BDBM50353279 CHEMBL1830683::CHEMBL259582
SMILES: COc1cc2CCN(CCCC3CCCc4c(OC)cccc34)Cc2cc1OC
InChI Key: InChIKey=HHPVCRYYLOFYGE-UHFFFAOYSA-N
Data: 2 KI  4 EC50
Activity Spreadsheet -- Enzyme Inhibition Constant Data from BindingDB
Found 6 hits for monomerid = 50353279
Trg + Lig
Ki
nM
ΔG°
kcal/mole
IC50
nM
Kd
nM
EC50/IC50
nM
koff
s-1
kon
M-1s-1
pHTemp
°C
Sigma non-opioid intracellular receptor 1
(Cavia porcellus (Guinea pig))
BDBM50353279
(CHEMBL1830683 | CHEMBL259582)
Show SMILES COc1cc2CCN(CCCC3CCCc4c(OC)cccc34)Cc2cc1OC
Show InChI InChI=1S/C25H33NO3/c1-27-23-11-5-9-21-18(7-4-10-22(21)23)8-6-13-26-14-12-19-15-24(28-2)25(29-3)16-20(19)17-26/h5,9,11,15-16,18H,4,6-8,10,12-14,17H2,1-3H3
151n/an/an/an/an/an/an/an/a
Universit£ degli Studi di Bari ALDO MORO
Curated by ChEMBL
Assay Description
Displacement of [3H]-pentazocine from sigma 1 receptor in guinea pig brain after 30 mins by radioligand binding assay
Eur J Med Chem 46: 4733-41 (2011)
Article DOI: 10.1016/j.ejmech.2011.05.057
BindingDB Entry DOI: 10.7270/Q2B56KQ5
Sigma non-opioid intracellular receptor 1
(Cavia porcellus (Guinea pig))
BDBM50353279
(CHEMBL1830683 | CHEMBL259582)
Show SMILES COc1cc2CCN(CCCC3CCCc4c(OC)cccc34)Cc2cc1OC
Show InChI InChI=1S/C25H33NO3/c1-27-23-11-5-9-21-18(7-4-10-22(21)23)8-6-13-26-14-12-19-15-24(28-2)25(29-3)16-20(19)17-26/h5,9,11,15-16,18H,4,6-8,10,12-14,17H2,1-3H3
151n/an/an/an/an/an/an/an/a
Universit£ degli Studi di Bari ALDO MORO
Curated by ChEMBL
Assay Description
Displacement of [3H]-(+)-pentazocine from guinea pig brain sigma1 receptor by scintillation counting analysis
Eur J Med Chem 89: 606-15 (2014)
Article DOI: 10.1016/j.ejmech.2014.10.082
BindingDB Entry DOI: 10.7270/Q2S75HZT
P-glycoprotein 1
(Homo sapiens (Human))
BDBM50353279
(CHEMBL1830683 | CHEMBL259582)
Show SMILES COc1cc2CCN(CCCC3CCCc4c(OC)cccc34)Cc2cc1OC
Show InChI InChI=1S/C25H33NO3/c1-27-23-11-5-9-21-18(7-4-10-22(21)23)8-6-13-26-14-12-19-15-24(28-2)25(29-3)16-20(19)17-26/h5,9,11,15-16,18H,4,6-8,10,12-14,17H2,1-3H3
n/an/an/an/a 6.35E+3n/an/an/an/a
Universit£ degli Studi di Bari
Curated by ChEMBL
Assay Description
Inhibition of human Pgp mediated [3H]vinblastine transport in human Caco-2 cells
Bioorg Med Chem 16: 362-73 (2008)
Article DOI: 10.1016/j.bmc.2007.09.039
BindingDB Entry DOI: 10.7270/Q2ST7QQS
P-glycoprotein 1
(Homo sapiens (Human))
BDBM50353279
(CHEMBL1830683 | CHEMBL259582)
Show SMILES COc1cc2CCN(CCCC3CCCc4c(OC)cccc34)Cc2cc1OC
Show InChI InChI=1S/C25H33NO3/c1-27-23-11-5-9-21-18(7-4-10-22(21)23)8-6-13-26-14-12-19-15-24(28-2)25(29-3)16-20(19)17-26/h5,9,11,15-16,18H,4,6-8,10,12-14,17H2,1-3H3
n/an/an/an/a 6.35E+3n/an/an/an/a
Universit£ degli Studi di Bari ALDO MORO
Curated by ChEMBL
Assay Description
Activity at MDR1 (unknown origin) expressed in MDCK cells assessed as interference with calcein-AM efflux incubated for 30 mins prior to calcein-Am a...
Bioorg Med Chem 21: 1324-32 (2013)
Article DOI: 10.1016/j.bmc.2012.12.021
BindingDB Entry DOI: 10.7270/Q2HH6MDJ
P-glycoprotein 1
(Homo sapiens (Human))
BDBM50353279
(CHEMBL1830683 | CHEMBL259582)
Show SMILES COc1cc2CCN(CCCC3CCCc4c(OC)cccc34)Cc2cc1OC
Show InChI InChI=1S/C25H33NO3/c1-27-23-11-5-9-21-18(7-4-10-22(21)23)8-6-13-26-14-12-19-15-24(28-2)25(29-3)16-20(19)17-26/h5,9,11,15-16,18H,4,6-8,10,12-14,17H2,1-3H3
n/an/an/an/a 6.35E+3n/an/an/an/a
Universit£ degli Studi di Bari"A. Moro"
Curated by ChEMBL
Assay Description
Inhibition of MDR1 (unknown origin) over-expressed in MDCK cells assessed as calcein accumulation incubated for 30 mins prior to Calcein-AM addition ...
J Med Chem 57: 9983-94 (2014)
Article DOI: 10.1021/jm501640e
BindingDB Entry DOI: 10.7270/Q2K9394N
Multidrug resistance protein 1/Multidrug resistance associated protein 1
(Homo sapiens (Human))
BDBM50353279
(CHEMBL1830683 | CHEMBL259582)
Show SMILES COc1cc2CCN(CCCC3CCCc4c(OC)cccc34)Cc2cc1OC
Show InChI InChI=1S/C25H33NO3/c1-27-23-11-5-9-21-18(7-4-10-22(21)23)8-6-13-26-14-12-19-15-24(28-2)25(29-3)16-20(19)17-26/h5,9,11,15-16,18H,4,6-8,10,12-14,17H2,1-3H3
n/an/an/an/a>1.00E+5n/an/an/an/a
Universit£ degli Studi di Bari ALDO MORO
Curated by ChEMBL
Assay Description
Activity at MRP1 (unknown origin) expressed in MDCK cells assessed as interference calcein-AM efflux incubated for 30 mins prior to calcein-Am additi...
Bioorg Med Chem 21: 1324-32 (2013)
Article DOI: 10.1016/j.bmc.2012.12.021
BindingDB Entry DOI: 10.7270/Q2HH6MDJ