BDBM50354039 CHEMBL1829582
SMILES: OC(=O)CCNC(=O)[C@H](Cc1ccccc1)NCC(O)=O
InChI Key: InChIKey=NRFZUXDTHMEYQN-NSHDSACASA-N
Data: 1 IC50
Activity Spreadsheet -- Enzyme Inhibition Constant Data from BindingDB
Found 1 hit for monomerid = 50354039
Trg + Lig
Ki
nM
ΔG°
kcal/mole
IC50
nM
Kd
nM
EC50/IC50
nM
koff
s-1
kon
M-1s-1
pHTemp
°C
Neprilysin
(Homo sapiens (Human))
BDBM50354039
(CHEMBL1829582)
Show SMILES OC(=O)CCNC(=O)[C@H](Cc1ccccc1)NCC(O)=O |r|
Show InChI InChI=1S/C14H18N2O5/c17-12(18)6-7-15-14(21)11(16-9-13(19)20)8-10-4-2-1-3-5-10/h1-5,11,16H,6-9H2,(H,15,21)(H,17,18)(H,19,20)/t11-/m0/s1
n/an/a 4.40E+4n/an/an/an/an/an/a
Kao Corporation
Curated by ChEMBL
Assay Description
Inhibition of neutral endopeptidase in human fibroblasts homogenates using glutaryl-Ala-Ala-Phe-4-methoxy-2-naphtylamide as substrate after 1 hrs by ...
Bioorg Med Chem 19: 5935-47 (2011)
Article DOI: 10.1016/j.bmc.2011.08.064
BindingDB Entry DOI: 10.7270/Q2154HF6