BDBM50354256 CHEMBL1836460
SMILES: COc1ccccc1CSc1nc(SCc2ccccc2)nc(=O)[nH]1
InChI Key: InChIKey=IKFRWHXPXCHEFR-UHFFFAOYSA-N
Data: 2 KI  1 IC50
Activity Spreadsheet -- Enzyme Inhibition Constant Data from BindingDB
Found 3 hits for monomerid = 50354256
Trg + Lig
Ki
nM
ΔG°
kcal/mole
IC50
nM
Kd
nM
EC50/IC50
nM
koff
s-1
kon
M-1s-1
pHTemp
°C
Cathepsin B
(Homo sapiens (Human))
BDBM50354256
(CHEMBL1836460)
Show SMILES COc1ccccc1CSc1nc(SCc2ccccc2)nc(=O)[nH]1
Show InChI InChI=1S/C18H17N3O2S2/c1-23-15-10-6-5-9-14(15)12-25-18-20-16(22)19-17(21-18)24-11-13-7-3-2-4-8-13/h2-10H,11-12H2,1H3,(H,19,20,21,22)
Reactome pathway
4.40E+3n/an/an/an/an/an/an/an/a
University of Ljubljana
Curated by ChEMBL
Assay Description
Partial mixed-type inhibition of human recombinant cathepsin B assessed as formation of fluorescent degradation product AMC using Z-Arg-Arg-AMC as su...
Eur J Med Chem 46: 4648-56 (2011)
Article DOI: 10.1016/j.ejmech.2011.08.005
BindingDB Entry DOI: 10.7270/Q2M045TJ
Cathepsin B
(Homo sapiens (Human))
BDBM50354256
(CHEMBL1836460)
Show SMILES COc1ccccc1CSc1nc(SCc2ccccc2)nc(=O)[nH]1
Show InChI InChI=1S/C18H17N3O2S2/c1-23-15-10-6-5-9-14(15)12-25-18-20-16(22)19-17(21-18)24-11-13-7-3-2-4-8-13/h2-10H,11-12H2,1H3,(H,19,20,21,22)
Reactome pathway
1.56E+4n/an/an/an/an/an/an/an/a
University of Ljubljana
Curated by ChEMBL
Assay Description
Reversible inhibition of human recombinant cathepsin B assessed as formation of fluorescent degradation product AMC using Z-Arg-Arg-AMC as substrate ...
Eur J Med Chem 46: 4648-56 (2011)
Article DOI: 10.1016/j.ejmech.2011.08.005
BindingDB Entry DOI: 10.7270/Q2M045TJ
Topoisomerase II alpha (HuTopoIIα)
(Homo sapiens (Human))
BDBM50354256
(CHEMBL1836460)
Show SMILES COc1ccccc1CSc1nc(SCc2ccccc2)nc(=O)[nH]1
Show InChI InChI=1S/C18H17N3O2S2/c1-23-15-10-6-5-9-14(15)12-25-18-20-16(22)19-17(21-18)24-11-13-7-3-2-4-8-13/h2-10H,11-12H2,1H3,(H,19,20,21,22)
n/an/a>1.00E+6n/an/an/an/an/an/a
National Institute of Chemistry
Curated by ChEMBL
Assay Description
Inhibition of human DNA topoisomerase IIalpha using plasmid pNO1 as a substrate after 30 mins
Bioorg Med Chem 23: 4218-29 (2015)
BindingDB Entry DOI: 10.7270/Q2RJ4M72