BDBM50354445 CHEMBL1836810
SMILES: Cc1cn2c(cnc2c(Nc2ccc(C(=O)N3CCOCC3)c(Cl)c2)n1)-c1cn[nH]c1
InChI Key: InChIKey=AXMMFQYWZDPEFR-UHFFFAOYSA-N
Data: 4 IC50
Activity Spreadsheet -- Enzyme Inhibition Constant Data from BindingDB
Found 4 hits for monomerid = 50354445
Trg + Lig
Ki
nM
ΔG°
kcal/mole
IC50
nM
Kd
nM
EC50/IC50
nM
koff
s-1
kon
M-1s-1
pHTemp
°C
Aurora kinase B
(Homo sapiens (Human))
BDBM50354445
(CHEMBL1836810)
Show SMILES Cc1cn2c(cnc2c(Nc2ccc(C(=O)N3CCOCC3)c(Cl)c2)n1)-c1cn[nH]c1
Show InChI InChI=1S/C21H20ClN7O2/c1-13-12-29-18(14-9-24-25-10-14)11-23-20(29)19(26-13)27-15-2-3-16(17(22)8-15)21(30)28-4-6-31-7-5-28/h2-3,8-12H,4-7H2,1H3,(H,24,25)(H,26,27)
Reactome pathway
n/an/a 43n/an/an/an/an/an/a
Merck Research Laboratories
Curated by ChEMBL
Assay Description
Inhibition of AurB
Bioorg Med Chem Lett 21: 5870-5 (2011)
Article DOI: 10.1016/j.bmcl.2011.07.101
BindingDB Entry DOI: 10.7270/Q2PR7WCR
Tyrosine-protein kinase BRK
(Homo sapiens (Human))
BDBM50354445
(CHEMBL1836810)
Show SMILES Cc1cn2c(cnc2c(Nc2ccc(C(=O)N3CCOCC3)c(Cl)c2)n1)-c1cn[nH]c1
Show InChI InChI=1S/C21H20ClN7O2/c1-13-12-29-18(14-9-24-25-10-14)11-23-20(29)19(26-13)27-15-2-3-16(17(22)8-15)21(30)28-4-6-31-7-5-28/h2-3,8-12H,4-7H2,1H3,(H,24,25)(H,26,27)
n/an/a 8n/an/an/an/an/an/a
Merck Research Laboratories
Curated by ChEMBL
Assay Description
Inhibition of BRK pretreated for 30 mins by microplate reader
Bioorg Med Chem Lett 21: 5870-5 (2011)
Article DOI: 10.1016/j.bmcl.2011.07.101
BindingDB Entry DOI: 10.7270/Q2PR7WCR
Tyrosine-protein kinase Lck
(Homo sapiens (Human))
BDBM50354445
(CHEMBL1836810)
Show SMILES Cc1cn2c(cnc2c(Nc2ccc(C(=O)N3CCOCC3)c(Cl)c2)n1)-c1cn[nH]c1
Show InChI InChI=1S/C21H20ClN7O2/c1-13-12-29-18(14-9-24-25-10-14)11-23-20(29)19(26-13)27-15-2-3-16(17(22)8-15)21(30)28-4-6-31-7-5-28/h2-3,8-12H,4-7H2,1H3,(H,24,25)(H,26,27)
n/an/a 2.00E+3n/an/an/an/an/an/a
Merck Research Laboratories
Curated by ChEMBL
Assay Description
Inhibition of LCK
Bioorg Med Chem Lett 21: 5870-5 (2011)
Article DOI: 10.1016/j.bmcl.2011.07.101
BindingDB Entry DOI: 10.7270/Q2PR7WCR
Tyrosine-protein kinase BRK
(Homo sapiens (Human))
BDBM50354445
(CHEMBL1836810)
Show SMILES Cc1cn2c(cnc2c(Nc2ccc(C(=O)N3CCOCC3)c(Cl)c2)n1)-c1cn[nH]c1
Show InChI InChI=1S/C21H20ClN7O2/c1-13-12-29-18(14-9-24-25-10-14)11-23-20(29)19(26-13)27-15-2-3-16(17(22)8-15)21(30)28-4-6-31-7-5-28/h2-3,8-12H,4-7H2,1H3,(H,24,25)(H,26,27)
n/an/a 254n/an/an/an/an/an/a
Merck Research Laboratories
Curated by ChEMBL
Assay Description
Inhibition of phosphorylated SAM68 in 293 WT-PTK6 cells after 3 hrs
Bioorg Med Chem Lett 21: 5870-5 (2011)
Article DOI: 10.1016/j.bmcl.2011.07.101
BindingDB Entry DOI: 10.7270/Q2PR7WCR