BDBM50354542 CHEMBL1836721
SMILES: NC(=O)c1ccc(cc1)-c1cc2ncnc(SCC(O)=O)c2s1
InChI Key: InChIKey=MAUXTEABCSHUTA-UHFFFAOYSA-N
Data: 1 IC50
Activity Spreadsheet -- Enzyme Inhibition Constant Data from BindingDB
Found 3 hits for monomerid = 50354542
Trg + Lig
Ki
nM
ΔG°
kcal/mole
IC50
nM
Kd
nM
EC50/IC50
nM
koff
s-1
kon
M-1s-1
pHTemp
°C
Mitogen-activated protein kinase kinase kinase 8
(Homo sapiens (Human))
BDBM50354542
(CHEMBL1836721)
Show SMILES NC(=O)c1ccc(cc1)-c1cc2ncnc(SCC(O)=O)c2s1
Show InChI InChI=1S/C15H11N3O3S2/c16-14(21)9-3-1-8(2-4-9)11-5-10-13(23-11)15(18-7-17-10)22-6-12(19)20/h1-5,7H,6H2,(H2,16,21)(H,19,20)
NCI pathway
Reactome pathway
n/an/a 1.50E+3n/an/an/an/an/an/a
Pfizer Inc.
Curated by ChEMBL
Assay Description
Inhibition of TPL2
Bioorg Med Chem Lett 21: 5952-6 (2011)
Article DOI: 10.1016/j.bmcl.2011.07.069
BindingDB Entry DOI: 10.7270/Q2X63NC0
Serine/threonine-protein kinase 17B (STK17B)
(Homo sapiens (Human))
BDBM50354542
(CHEMBL1836721)
Show SMILES NC(=O)c1ccc(cc1)-c1cc2ncnc(SCC(O)=O)c2s1
Show InChI InChI=1S/C15H11N3O3S2/c16-14(21)9-3-1-8(2-4-9)11-5-10-13(23-11)15(18-7-17-10)22-6-12(19)20/h1-5,7H,6H2,(H2,16,21)(H,19,20)
n/an/an/a 11n/an/an/an/an/a
TBA
Citation and Details
Serine/threonine-protein kinase 17A
(Homo sapiens (Human))
BDBM50354542
(CHEMBL1836721)
Show SMILES NC(=O)c1ccc(cc1)-c1cc2ncnc(SCC(O)=O)c2s1
Show InChI InChI=1S/C15H11N3O3S2/c16-14(21)9-3-1-8(2-4-9)11-5-10-13(23-11)15(18-7-17-10)22-6-12(19)20/h1-5,7H,6H2,(H2,16,21)(H,19,20)
n/an/an/a 270n/an/an/an/an/a
TBA
Citation and Details