BDBM50354762 CHEMBL1834123
SMILES: COc1c(NCCCc2ccccc2)c(F)c(N)c2c1n(cc(C(O)=O)c2=O)C1CC1
InChI Key: InChIKey=SCUNYAMJRPWYRG-UHFFFAOYSA-N
Data: 1 IC50
Activity Spreadsheet -- Enzyme Inhibition Constant Data from BindingDB
Found 1 hit for monomerid = 50354762
Trg + Lig
Ki
nM
ΔG°
kcal/mole
IC50
nM
Kd
nM
EC50/IC50
nM
koff
s-1
kon
M-1s-1
pHTemp
°C
Glycogen synthase kinase-3 beta
(Homo sapiens (Human))
BDBM50354762
(CHEMBL1834123)
Show SMILES COc1c(NCCCc2ccccc2)c(F)c(N)c2c1n(cc(C(O)=O)c2=O)C1CC1
Show InChI InChI=1S/C23H24FN3O4/c1-31-22-19(26-11-5-8-13-6-3-2-4-7-13)17(24)18(25)16-20(22)27(14-9-10-14)12-15(21(16)28)23(29)30/h2-4,6-7,12,14,26H,5,8-11,25H2,1H3,(H,29,30)
NCI pathway
Reactome pathway
n/an/a 65n/an/an/an/an/an/a
ActivX Biosciences, Inc.
Curated by ChEMBL
Assay Description
Inhibition of human recombinant full length GSK3beta after 1 hrs by luminescence assay
Bioorg Med Chem Lett 21: 5948-51 (2011)
Article DOI: 10.1016/j.bmcl.2011.07.073
BindingDB Entry DOI: 10.7270/Q23T9HMH