BDBM50354767 CHEMBL1834318
SMILES: Nc1c(F)c(NCCNc2ccccn2)c(F)c2n(cc(C(O)=O)c(=O)c12)C1CCCC1
InChI Key: InChIKey=BKVNXOAQHKZIMZ-UHFFFAOYSA-N
Data: 1 IC50
Activity Spreadsheet -- Enzyme Inhibition Constant Data from BindingDB
Found 1 hit for monomerid = 50354767
Trg + Lig
Ki
nM
ΔG°
kcal/mole
IC50
nM
Kd
nM
EC50/IC50
nM
koff
s-1
kon
M-1s-1
pHTemp
°C
Glycogen synthase kinase-3 beta
(Homo sapiens (Human))
BDBM50354767
(CHEMBL1834318)
Show SMILES Nc1c(F)c(NCCNc2ccccn2)c(F)c2n(cc(C(O)=O)c(=O)c12)C1CCCC1
Show InChI InChI=1S/C22H23F2N5O3/c23-16-18(25)15-20(17(24)19(16)28-10-9-27-14-7-3-4-8-26-14)29(12-5-1-2-6-12)11-13(21(15)30)22(31)32/h3-4,7-8,11-12,28H,1-2,5-6,9-10,25H2,(H,26,27)(H,31,32)
NCI pathway
Reactome pathway
n/an/a 22n/an/an/an/an/an/a
ActivX Biosciences, Inc.
Curated by ChEMBL
Assay Description
Inhibition of human recombinant full length GSK3beta after 1 hrs by luminescence assay
Bioorg Med Chem Lett 21: 5948-51 (2011)
Article DOI: 10.1016/j.bmcl.2011.07.073
BindingDB Entry DOI: 10.7270/Q23T9HMH