BDBM50355372 CHEMBL482212
SMILES: C[C@]12CC[C@H]3[C@@H](CCc4cc(O)ccc34)[C@@H]1CC[C@@]2(O)Cc1ccccc1
InChI Key: InChIKey=HMIDDXLVYVRYHN-WJGLBBAVSA-N
Data: 1 KI  6 IC50
Activity Spreadsheet -- Enzyme Inhibition Constant Data from BindingDB
Found 7 hits for monomerid = 50355372
Trg + Lig
Ki
nM
ΔG°
kcal/mole
IC50
nM
Kd
nM
EC50/IC50
nM
koff
s-1
kon
M-1s-1
pHTemp
°C
Steryl-sulfatase
(Homo sapiens (Human))
BDBM50355372
(CHEMBL482212)
Show SMILES C[C@]12CC[C@H]3[C@@H](CCc4cc(O)ccc34)[C@@H]1CC[C@@]2(O)Cc1ccccc1
Show InChI InChI=1S/C25H30O2/c1-24-13-11-21-20-10-8-19(26)15-18(20)7-9-22(21)23(24)12-14-25(24,27)16-17-5-3-2-4-6-17/h2-6,8,10,15,21-23,26-27H,7,9,11-14,16H2,1H3/t21-,22-,23+,24+,25-/m1/s1
250n/an/an/an/an/an/an/an/a
University of Waterloo
Curated by ChEMBL
Assay Description
Inhibition of human steroid sulfatase using 4-methylumbelliferyl sulfate substrate after 10 mins by fluorescence assay
Bioorg Med Chem 19: 5999-6005 (2011)
Article DOI: 10.1016/j.bmc.2011.08.046
BindingDB Entry DOI: 10.7270/Q2FX79VJ
Steryl-sulfatase
(Homo sapiens (Human))
BDBM50355372
(CHEMBL482212)
Show SMILES C[C@]12CC[C@H]3[C@@H](CCc4cc(O)ccc34)[C@@H]1CC[C@@]2(O)Cc1ccccc1
Show InChI InChI=1S/C25H30O2/c1-24-13-11-21-20-10-8-19(26)15-18(20)7-9-22(21)23(24)12-14-25(24,27)16-17-5-3-2-4-6-17/h2-6,8,10,15,21-23,26-27H,7,9,11-14,16H2,1H3/t21-,22-,23+,24+,25-/m1/s1
n/an/a 325n/an/an/an/an/an/a
Laval University Medical Research Center
Curated by ChEMBL
Assay Description
Compound was tested for its ability to inhibit the transformation of [C14]-DHEAS to DHEA by steroid sulfatase derived from human embryonal kidney cel...
J Med Chem 42: 2280-6 (1999)
Article DOI: 10.1021/jm980677l
BindingDB Entry DOI: 10.7270/Q2SN09M3
Steryl-sulfatase
(Homo sapiens (Human))
BDBM50355372
(CHEMBL482212)
Show SMILES C[C@]12CC[C@H]3[C@@H](CCc4cc(O)ccc34)[C@@H]1CC[C@@]2(O)Cc1ccccc1
Show InChI InChI=1S/C25H30O2/c1-24-13-11-21-20-10-8-19(26)15-18(20)7-9-22(21)23(24)12-14-25(24,27)16-17-5-3-2-4-6-17/h2-6,8,10,15,21-23,26-27H,7,9,11-14,16H2,1H3/t21-,22-,23+,24+,25-/m1/s1
n/an/a 310n/an/an/an/an/an/a
Laval University Medical Center (CHUL)
Curated by ChEMBL
Assay Description
Inhibition of steroid sulfatase activity of JEG-3 cells
J Med Chem 43: 4465-78 (2000)
BindingDB Entry DOI: 10.7270/Q2MC90QT
Steryl-sulfatase
(Homo sapiens (Human))
BDBM50355372
(CHEMBL482212)
Show SMILES C[C@]12CC[C@H]3[C@@H](CCc4cc(O)ccc34)[C@@H]1CC[C@@]2(O)Cc1ccccc1
Show InChI InChI=1S/C25H30O2/c1-24-13-11-21-20-10-8-19(26)15-18(20)7-9-22(21)23(24)12-14-25(24,27)16-17-5-3-2-4-6-17/h2-6,8,10,15,21-23,26-27H,7,9,11-14,16H2,1H3/t21-,22-,23+,24+,25-/m1/s1
n/an/a 325n/an/an/an/an/an/a
Laval University Medical Center (CHUL)
Curated by ChEMBL
Assay Description
Steroid sulfatase activity was determined in human embryonic kidney (HEK)-293 cells transfected with a sulfatase expression vector (pCMV-sulfa) using...
J Med Chem 43: 4465-78 (2000)
BindingDB Entry DOI: 10.7270/Q2MC90QT
Steryl-sulfatase
(Homo sapiens (Human))
BDBM50355372
(CHEMBL482212)
Show SMILES C[C@]12CC[C@H]3[C@@H](CCc4cc(O)ccc34)[C@@H]1CC[C@@]2(O)Cc1ccccc1
Show InChI InChI=1S/C25H30O2/c1-24-13-11-21-20-10-8-19(26)15-18(20)7-9-22(21)23(24)12-14-25(24,27)16-17-5-3-2-4-6-17/h2-6,8,10,15,21-23,26-27H,7,9,11-14,16H2,1H3/t21-,22-,23+,24+,25-/m1/s1
n/an/a 220n/an/an/an/an/an/a
Laval University Medical Center (CHUL)
Curated by ChEMBL
Assay Description
Steroid sulfatase activity was determined in human embryonic kidney (HEK)-293 cells transfected with a sulfatase expression vector (pCMV-sulfa) using...
J Med Chem 43: 4465-78 (2000)
BindingDB Entry DOI: 10.7270/Q2MC90QT
Steryl-sulfatase
(Homo sapiens (Human))
BDBM50355372
(CHEMBL482212)
Show SMILES C[C@]12CC[C@H]3[C@@H](CCc4cc(O)ccc34)[C@@H]1CC[C@@]2(O)Cc1ccccc1
Show InChI InChI=1S/C25H30O2/c1-24-13-11-21-20-10-8-19(26)15-18(20)7-9-22(21)23(24)12-14-25(24,27)16-17-5-3-2-4-6-17/h2-6,8,10,15,21-23,26-27H,7,9,11-14,16H2,1H3/t21-,22-,23+,24+,25-/m1/s1
n/an/a 310n/an/an/an/an/an/a
Laval University
Curated by ChEMBL
Assay Description
Estrone sulfatase activity against homogenized human JEG-3 cells was determined by measuring the [3H]E1 obtained from [3H]E1S
Bioorg Med Chem Lett 8: 1891-6 (1999)
BindingDB Entry DOI: 10.7270/Q2PV6KWD
Steryl-sulfatase
(Homo sapiens (Human))
BDBM50355372
(CHEMBL482212)
Show SMILES C[C@]12CC[C@H]3[C@@H](CCc4cc(O)ccc34)[C@@H]1CC[C@@]2(O)Cc1ccccc1
Show InChI InChI=1S/C25H30O2/c1-24-13-11-21-20-10-8-19(26)15-18(20)7-9-22(21)23(24)12-14-25(24,27)16-17-5-3-2-4-6-17/h2-6,8,10,15,21-23,26-27H,7,9,11-14,16H2,1H3/t21-,22-,23+,24+,25-/m1/s1
n/an/a 230n/an/an/an/an/an/a
Laval University Medical Research Center
Curated by ChEMBL
Assay Description
Compound was tested for its ability to inhibit human embryonal kidney cell derived steroid sulfatase activity in transforming [3H]E1S (estrone sulfat...
J Med Chem 42: 2280-6 (1999)
Article DOI: 10.1021/jm980677l
BindingDB Entry DOI: 10.7270/Q2SN09M3