BDBM50355530 CHEMBL1824499
SMILES: COCCc1ccc(Cl)c(CN(C2CC2)C(=O)[C@H]2CNCC[C@]2(O)c2ccc(F)c(F)c2)c1
InChI Key: InChIKey=UFNDAMPQZLFUFY-NLFFAJNJSA-N
Data: 1 KI  2 IC50
Activity Spreadsheet -- Enzyme Inhibition Constant Data from BindingDB
Found 3 hits for monomerid = 50355530
Trg + Lig
Ki
nM
ΔG°
kcal/mole
IC50
nM
Kd
nM
EC50/IC50
nM
koff
s-1
kon
M-1s-1
pHTemp
°C
Potassium voltage-gated channel subfamily H member 2
(Homo sapiens (Human))
BDBM50355530
(CHEMBL1824499)
Show SMILES COCCc1ccc(Cl)c(CN(C2CC2)C(=O)[C@H]2CNCC[C@]2(O)c2ccc(F)c(F)c2)c1 |r|
Show InChI InChI=1S/C25H29ClF2N2O3/c1-33-11-8-16-2-6-21(26)17(12-16)15-30(19-4-5-19)24(31)20-14-29-10-9-25(20,32)18-3-7-22(27)23(28)13-18/h2-3,6-7,12-13,19-20,29,32H,4-5,8-11,14-15H2,1H3/t20-,25+/m1/s1
Reactome pathway
2.20E+3n/an/an/an/an/an/an/an/a
Merck Frosst Centre for Therapeutic Research
Curated by ChEMBL
Assay Description
Binding affinity to human ERG
Bioorg Med Chem Lett 21: 3976-81 (2011)
Article DOI: 10.1016/j.bmcl.2011.05.014
BindingDB Entry DOI: 10.7270/Q21N81HN
Renin
(Homo sapiens (Human))
BDBM50355530
(CHEMBL1824499)
Show SMILES COCCc1ccc(Cl)c(CN(C2CC2)C(=O)[C@H]2CNCC[C@]2(O)c2ccc(F)c(F)c2)c1 |r|
Show InChI InChI=1S/C25H29ClF2N2O3/c1-33-11-8-16-2-6-21(26)17(12-16)15-30(19-4-5-19)24(31)20-14-29-10-9-25(20,32)18-3-7-22(27)23(28)13-18/h2-3,6-7,12-13,19-20,29,32H,4-5,8-11,14-15H2,1H3/t20-,25+/m1/s1
Reactome pathway
n/an/a 1.20n/an/an/an/an/an/a
Merck Frosst Centre for Therapeutic Research
Curated by ChEMBL
Assay Description
Inhibition of human recombinant renin using DNP-Lys-His-Pro-Phe-His-Leu-Val-Ile-His-D,L-Amp as Q-FRET substrate after 3 hrs by fluorescence assay
Bioorg Med Chem Lett 21: 3976-81 (2011)
Article DOI: 10.1016/j.bmcl.2011.05.014
BindingDB Entry DOI: 10.7270/Q21N81HN
Renin
(Homo sapiens (Human))
BDBM50355530
(CHEMBL1824499)
Show SMILES COCCc1ccc(Cl)c(CN(C2CC2)C(=O)[C@H]2CNCC[C@]2(O)c2ccc(F)c(F)c2)c1 |r|
Show InChI InChI=1S/C25H29ClF2N2O3/c1-33-11-8-16-2-6-21(26)17(12-16)15-30(19-4-5-19)24(31)20-14-29-10-9-25(20,32)18-3-7-22(27)23(28)13-18/h2-3,6-7,12-13,19-20,29,32H,4-5,8-11,14-15H2,1H3/t20-,25+/m1/s1
Reactome pathway
n/an/a 110n/an/an/an/an/an/a
Merck Frosst Centre for Therapeutic Research
Curated by ChEMBL
Assay Description
Inhibition of human recombinant renin in human plasma using QXL520-Lys-His-Pro-Phe-His-Leu-Val-Ile-His-Lys-(5-FAM) as Q-FRET substrate after 1 hr by ...
Bioorg Med Chem Lett 21: 3976-81 (2011)
Article DOI: 10.1016/j.bmcl.2011.05.014
BindingDB Entry DOI: 10.7270/Q21N81HN