BDBM50355569 CHEMBL1910637
SMILES: NC(=N)N\N=C\c1c(nc2sc(Cl)cn12)-c1cccc(c1)[N+]([O-])=O
InChI Key: InChIKey=ZUCVGJVUJSOEMH-YAXRCOADSA-N
Data: 3 IC50
Activity Spreadsheet -- Enzyme Inhibition Constant Data from BindingDB
Found 3 hits for monomerid = 50355569
Trg + Lig
Ki
nM
ΔG°
kcal/mole
IC50
nM
Kd
nM
EC50/IC50
nM
koff
s-1
kon
M-1s-1
pHTemp
°C
Serine/threonine-protein kinase Chk1
(Homo sapiens (Human))
BDBM50355569
(CHEMBL1910637)
Show SMILES NC(=N)N\N=C\c1c(nc2sc(Cl)cn12)-c1cccc(c1)[N+]([O-])=O
Show InChI InChI=1S/C13H10ClN7O2S/c14-10-6-20-9(5-17-19-12(15)16)11(18-13(20)24-10)7-2-1-3-8(4-7)21(22)23/h1-6H,(H4,15,16,19)/b17-5+
Reactome pathway
n/an/a>1.00E+5n/an/an/an/an/an/a
Universit£ di Bologna
Curated by ChEMBL
Assay Description
Inhibition of CHK1 assessed as inhibition of substrate phosphorylation using fluorescent peptide substrate by microplate reader assay
Eur J Med Chem 46: 4311-23 (2011)
Article DOI: 10.1016/j.ejmech.2011.07.001
BindingDB Entry DOI: 10.7270/Q2NG4R1D
Serine/threonine-protein kinase CHK2
(Homo sapiens (Human))
BDBM50355569
(CHEMBL1910637)
Show SMILES NC(=N)N\N=C\c1c(nc2sc(Cl)cn12)-c1cccc(c1)[N+]([O-])=O
Show InChI InChI=1S/C13H10ClN7O2S/c14-10-6-20-9(5-17-19-12(15)16)11(18-13(20)24-10)7-2-1-3-8(4-7)21(22)23/h1-6H,(H4,15,16,19)/b17-5+
n/an/a>1.00E+5n/an/an/an/an/an/a
Universit£ di Bologna
Curated by ChEMBL
Assay Description
Inhibition of CHK2 assessed as inhibition of substrate phosphorylation using fluorescent peptide substrate by microplate reader assay
Eur J Med Chem 46: 4311-23 (2011)
Article DOI: 10.1016/j.ejmech.2011.07.001
BindingDB Entry DOI: 10.7270/Q2NG4R1D
Ribosomal protein S6 kinase alpha-3
(Homo sapiens (Human))
BDBM50355569
(CHEMBL1910637)
Show SMILES NC(=N)N\N=C\c1c(nc2sc(Cl)cn12)-c1cccc(c1)[N+]([O-])=O
Show InChI InChI=1S/C13H10ClN7O2S/c14-10-6-20-9(5-17-19-12(15)16)11(18-13(20)24-10)7-2-1-3-8(4-7)21(22)23/h1-6H,(H4,15,16,19)/b17-5+
Reactome pathway
n/an/a 6.03E+3n/an/an/an/an/an/a
Universit£ di Bologna
Curated by ChEMBL
Assay Description
Inhibition of RSK2 assessed as inhibition of substrate phosphorylation using fluorescent peptide substrate by microplate reader assay
Eur J Med Chem 46: 4311-23 (2011)
Article DOI: 10.1016/j.ejmech.2011.07.001
BindingDB Entry DOI: 10.7270/Q2NG4R1D