BDBM50355659 CHEMBL1910981
SMILES: NC(=O)[C@H](Cc1ccc(CN=C(N)CF)cc1)NC(=O)c1ccccc1
InChI Key: InChIKey=RNKUFKLZNUHJKO-INIZCTEOSA-N
Data: 1 IC50
Activity Spreadsheet -- Enzyme Inhibition Constant Data from BindingDB
Found 1 hit for monomerid = 50355659
Trg + Lig
Ki
nM
ΔG°
kcal/mole
IC50
nM
Kd
nM
EC50/IC50
nM
koff
s-1
kon
M-1s-1
pHTemp
°C
protein-arginine deiminase type-4
(Homo sapiens (Human))
BDBM50355659
(CHEMBL1910981)
Show SMILES NC(=O)[C@H](Cc1ccc(CN=C(N)CF)cc1)NC(=O)c1ccccc1 |r,w:10.9|
Show InChI InChI=1S/C19H21FN4O2/c20-11-17(21)23-12-14-8-6-13(7-9-14)10-16(18(22)25)24-19(26)15-4-2-1-3-5-15/h1-9,16H,10-12H2,(H2,21,23)(H2,22,25)(H,24,26)/t16-/m0/s1
n/an/a>1.00E+6n/an/an/an/an/an/a
The Scripps Research Institute
Curated by ChEMBL
Assay Description
Irreversible inhibition of PAD4 assessed as hydrolysis of benzoyl-L-arginine ethyl ester preincubated for 15 mins measured after 15 mins by fluoromet...
J Med Chem 54: 6919-35 (2011)
Article DOI: 10.1021/jm2008985
BindingDB Entry DOI: 10.7270/Q24F1R4M