BDBM50355732 CHEMBL1911279
SMILES: CC(C)([C@H]1c2ccccc2Oc2nc(ccc12)-c1ccc(C(=O)N2CCOCC2)c(F)c1)C(=O)Nc1nncs1
InChI Key: InChIKey=MYDJGYVACPZCPA-DEOSSOPVSA-N
Data: 1 KI  5 EC50
Activity Spreadsheet -- Enzyme Inhibition Constant Data from BindingDB
Found 6 hits for monomerid = 50355732
Trg + Lig
Ki
nM
ΔG°
kcal/mole
IC50
nM
Kd
nM
EC50/IC50
nM
koff
s-1
kon
M-1s-1
pHTemp
°C
Glucocorticoid receptor
(Homo sapiens (Human))
BDBM50355732
(CHEMBL1911279)
Show SMILES CC(C)([C@H]1c2ccccc2Oc2nc(ccc12)-c1ccc(C(=O)N2CCOCC2)c(F)c1)C(=O)Nc1nncs1 |r|
Show InChI InChI=1S/C29H26FN5O4S/c1-29(2,27(37)33-28-34-31-16-40-28)24-19-5-3-4-6-23(19)39-25-20(24)9-10-22(32-25)17-7-8-18(21(30)15-17)26(36)35-11-13-38-14-12-35/h3-10,15-16,24H,11-14H2,1-2H3,(H,33,34,37)/t24-/m0/s1
2.70n/an/an/an/an/an/an/an/a
Bristol-Myers Squibb Company
Curated by ChEMBL
Assay Description
Displacement of GS-red from glucocorticoid receptor by fluorescence polarization assay
J Med Chem 54: 7318-33 (2011)
Article DOI: 10.1021/jm200879j
BindingDB Entry DOI: 10.7270/Q2W0969M
Glucocorticoid receptor
(Homo sapiens (Human))
BDBM50355732
(CHEMBL1911279)
Show SMILES CC(C)([C@H]1c2ccccc2Oc2nc(ccc12)-c1ccc(C(=O)N2CCOCC2)c(F)c1)C(=O)Nc1nncs1 |r|
Show InChI InChI=1S/C29H26FN5O4S/c1-29(2,27(37)33-28-34-31-16-40-28)24-19-5-3-4-6-23(19)39-25-20(24)9-10-22(32-25)17-7-8-18(21(30)15-17)26(36)35-11-13-38-14-12-35/h3-10,15-16,24H,11-14H2,1-2H3,(H,33,34,37)/t24-/m0/s1
n/an/an/an/a 11.7n/an/an/an/a
Bristol-Myers Squibb Company
Curated by ChEMBL
Assay Description
Transrepression activity at glucocorticoid receptor alpha in IL-1beta-stimulated human A549 cells assessed as inhibition of NFkappaB-dependent E-sele...
J Med Chem 54: 7318-33 (2011)
Article DOI: 10.1021/jm200879j
BindingDB Entry DOI: 10.7270/Q2W0969M
Glucocorticoid receptor
(Homo sapiens (Human))
BDBM50355732
(CHEMBL1911279)
Show SMILES CC(C)([C@H]1c2ccccc2Oc2nc(ccc12)-c1ccc(C(=O)N2CCOCC2)c(F)c1)C(=O)Nc1nncs1 |r|
Show InChI InChI=1S/C29H26FN5O4S/c1-29(2,27(37)33-28-34-31-16-40-28)24-19-5-3-4-6-23(19)39-25-20(24)9-10-22(32-25)17-7-8-18(21(30)15-17)26(36)35-11-13-38-14-12-35/h3-10,15-16,24H,11-14H2,1-2H3,(H,33,34,37)/t24-/m0/s1
n/an/an/an/a 93n/an/an/an/a
Bristol-Myers Squibb Company
Curated by ChEMBL
Assay Description
Transactivation activity at glucocorticoid receptor alpha human 13D3/Huh7 cells assessed as induction of TAT activity after 4 hrs by spectrophotometr...
J Med Chem 54: 7318-33 (2011)
Article DOI: 10.1021/jm200879j
BindingDB Entry DOI: 10.7270/Q2W0969M
Glucocorticoid receptor
(Homo sapiens (Human))
BDBM50355732
(CHEMBL1911279)
Show SMILES CC(C)([C@H]1c2ccccc2Oc2nc(ccc12)-c1ccc(C(=O)N2CCOCC2)c(F)c1)C(=O)Nc1nncs1 |r|
Show InChI InChI=1S/C29H26FN5O4S/c1-29(2,27(37)33-28-34-31-16-40-28)24-19-5-3-4-6-23(19)39-25-20(24)9-10-22(32-25)17-7-8-18(21(30)15-17)26(36)35-11-13-38-14-12-35/h3-10,15-16,24H,11-14H2,1-2H3,(H,33,34,37)/t24-/m0/s1
n/an/an/an/a 34.4n/an/an/an/a
Bristol-Myers Squibb Company
Curated by ChEMBL
Assay Description
Transactivation activity at GR-alpha in human NP1 Hela cells assessed as inhibition of GAL4-DBD after 20 hrs by luciferase reporter gene assay
J Med Chem 54: 7318-33 (2011)
Article DOI: 10.1021/jm200879j
BindingDB Entry DOI: 10.7270/Q2W0969M
Glucocorticoid receptor
(Homo sapiens (Human))
BDBM50355732
(CHEMBL1911279)
Show SMILES CC(C)([C@H]1c2ccccc2Oc2nc(ccc12)-c1ccc(C(=O)N2CCOCC2)c(F)c1)C(=O)Nc1nncs1 |r|
Show InChI InChI=1S/C29H26FN5O4S/c1-29(2,27(37)33-28-34-31-16-40-28)24-19-5-3-4-6-23(19)39-25-20(24)9-10-22(32-25)17-7-8-18(21(30)15-17)26(36)35-11-13-38-14-12-35/h3-10,15-16,24H,11-14H2,1-2H3,(H,33,34,37)/t24-/m0/s1
n/an/an/an/a 78.9n/an/an/an/a
Bristol-Myers Squibb Company
Curated by ChEMBL
Assay Description
Transactivation activity at GR-alpha in human NP1 Hela cells assessed as induction of GAL4-DBD after 20 hrs by luciferase reporter gene assay
J Med Chem 54: 7318-33 (2011)
Article DOI: 10.1021/jm200879j
BindingDB Entry DOI: 10.7270/Q2W0969M
Glucocorticoid receptor
(Homo sapiens (Human))
BDBM50355732
(CHEMBL1911279)
Show SMILES CC(C)([C@H]1c2ccccc2Oc2nc(ccc12)-c1ccc(C(=O)N2CCOCC2)c(F)c1)C(=O)Nc1nncs1 |r|
Show InChI InChI=1S/C29H26FN5O4S/c1-29(2,27(37)33-28-34-31-16-40-28)24-19-5-3-4-6-23(19)39-25-20(24)9-10-22(32-25)17-7-8-18(21(30)15-17)26(36)35-11-13-38-14-12-35/h3-10,15-16,24H,11-14H2,1-2H3,(H,33,34,37)/t24-/m0/s1
n/an/an/an/a 11.7n/an/an/an/a
Bristol-Myers Squibb Company
Curated by ChEMBL
Assay Description
Transrepression activity at glucocorticoid receptor alpha in phorbol myristate acetate-stimulated human A549 cells assessed as inhibition of AP1 resp...
J Med Chem 54: 7318-33 (2011)
Article DOI: 10.1021/jm200879j
BindingDB Entry DOI: 10.7270/Q2W0969M