BDBM50355915 CHEMBL1910201
SMILES: Oc1ccc(cc1)-c1ccnc(c1)-c1cc2cc(O)ccc2[nH]1
InChI Key: InChIKey=NLJFBOXPANMGKW-UHFFFAOYSA-N
Data: 2 IC50
Activity Spreadsheet -- Enzyme Inhibition Constant Data from BindingDB
Found 2 hits for monomerid = 50355915
Trg + Lig
Ki
nM
ΔG°
kcal/mole
IC50
nM
Kd
nM
EC50/IC50
nM
koff
s-1
kon
M-1s-1
pHTemp
°C
Cyclin-Dependent Kinase 5 (CDK5)
(Homo sapiens (Human))
BDBM50355915
(CHEMBL1910201)
Show SMILES Oc1ccc(cc1)-c1ccnc(c1)-c1cc2cc(O)ccc2[nH]1
Show InChI InChI=1S/C19H14N2O2/c22-15-3-1-12(2-4-15)13-7-8-20-18(10-13)19-11-14-9-16(23)5-6-17(14)21-19/h1-11,21-23H
NCI pathway
Reactome pathway
n/an/a 360n/an/an/an/an/an/a
Universit£ d'Orl£ans
Curated by ChEMBL
Assay Description
Inhibition of human recombinant CDK5/p25 using histone H1 and [33P-gamma]-ATP after 30 mins by scintillation counting
Eur J Med Chem 46: 5416-34 (2011)
Article DOI: 10.1016/j.ejmech.2011.08.048
BindingDB Entry DOI: 10.7270/Q2T1542V
Dual-specificity tyrosine-(Y)-phosphorylation regulated kinase 1A
(RAT)
BDBM50355915
(CHEMBL1910201)
Show SMILES Oc1ccc(cc1)-c1ccnc(c1)-c1cc2cc(O)ccc2[nH]1
Show InChI InChI=1S/C19H14N2O2/c22-15-3-1-12(2-4-15)13-7-8-20-18(10-13)19-11-14-9-16(23)5-6-17(14)21-19/h1-11,21-23H
n/an/a 230n/an/an/an/an/an/a
Universit£ d'Orl£ans
Curated by ChEMBL
Assay Description
Inhibition of rat recombinant GST-fused DYRK1A expressed in Escherichia coli using myelin protein and [33P-gamma]-ATP after 30 mins by scintillation ...
Eur J Med Chem 46: 5416-34 (2011)
Article DOI: 10.1016/j.ejmech.2011.08.048
BindingDB Entry DOI: 10.7270/Q2T1542V