BDBM50356037 CHEMBL1911543
SMILES: COc1ccc(F)cc1C(C)(C)C[C@](O)(Cc1cc2ccccc2[nH]1)C(F)(F)F
InChI Key: InChIKey=HINCRROTVFUICG-OAQYLSRUSA-N
Data: 4 IC50  1 EC50
Activity Spreadsheet -- Enzyme Inhibition Constant Data from BindingDB
Found 5 hits for monomerid = 50356037
Trg + Lig
Ki
nM
ΔG°
kcal/mole
IC50
nM
Kd
nM
EC50/IC50
nM
koff
s-1
kon
M-1s-1
pHTemp
°C
Glucocorticoid receptor
(Homo sapiens (Human))
BDBM50356037
(CHEMBL1911543)
Show SMILES COc1ccc(F)cc1C(C)(C)C[C@](O)(Cc1cc2ccccc2[nH]1)C(F)(F)F |r|
Show InChI InChI=1S/C22H23F4NO2/c1-20(2,17-11-15(23)8-9-19(17)29-3)13-21(28,22(24,25)26)12-16-10-14-6-4-5-7-18(14)27-16/h4-11,27-28H,12-13H2,1-3H3/t21-/m1/s1
n/an/a>2.00E+3n/an/an/an/an/an/a
Boehringer Ingelheim Pharmaceuticals
Curated by ChEMBL
Assay Description
Displacement of tetramethylrhodamine-labeled Dexamethasone from human recombinant glucocorticoid receptor expressed in baculovirus infected insect ce...
Bioorg Med Chem Lett 21: 6842-51 (2011)
Article DOI: 10.1016/j.bmcl.2011.09.018
BindingDB Entry DOI: 10.7270/Q2CV4J51
Progesterone receptor
(Homo sapiens (Human))
BDBM50356037
(CHEMBL1911543)
Show SMILES COc1ccc(F)cc1C(C)(C)C[C@](O)(Cc1cc2ccccc2[nH]1)C(F)(F)F |r|
Show InChI InChI=1S/C22H23F4NO2/c1-20(2,17-11-15(23)8-9-19(17)29-3)13-21(28,22(24,25)26)12-16-10-14-6-4-5-7-18(14)27-16/h4-11,27-28H,12-13H2,1-3H3/t21-/m1/s1
n/an/a 1.20E+3n/an/an/an/an/an/a
Boehringer Ingelheim Pharmaceuticals
Curated by ChEMBL
Assay Description
Displacement of tetramethylrhodamine-labeled RU-486 from human recombinant progesterone receptor expressed in baculovirus infected insect cells by fl...
Bioorg Med Chem Lett 21: 6842-51 (2011)
Article DOI: 10.1016/j.bmcl.2011.09.018
BindingDB Entry DOI: 10.7270/Q2CV4J51
Glucocorticoid receptor
(Homo sapiens (Human))
BDBM50356037
(CHEMBL1911543)
Show SMILES COc1ccc(F)cc1C(C)(C)C[C@](O)(Cc1cc2ccccc2[nH]1)C(F)(F)F |r|
Show InChI InChI=1S/C22H23F4NO2/c1-20(2,17-11-15(23)8-9-19(17)29-3)13-21(28,22(24,25)26)12-16-10-14-6-4-5-7-18(14)27-16/h4-11,27-28H,12-13H2,1-3H3/t21-/m1/s1
n/an/an/an/a>2.00E+3n/an/an/an/a
Boehringer Ingelheim Pharmaceuticals
Curated by ChEMBL
Assay Description
Transactivation activity of glucocorticoid receptor in HFF assessed as induction of aromatase activity by measuring beta-estradiol activity after 18 ...
Bioorg Med Chem Lett 21: 6842-51 (2011)
Article DOI: 10.1016/j.bmcl.2011.09.018
BindingDB Entry DOI: 10.7270/Q2CV4J51
Glucocorticoid receptor
(Homo sapiens (Human))
BDBM50356037
(CHEMBL1911543)
Show SMILES COc1ccc(F)cc1C(C)(C)C[C@](O)(Cc1cc2ccccc2[nH]1)C(F)(F)F |r|
Show InChI InChI=1S/C22H23F4NO2/c1-20(2,17-11-15(23)8-9-19(17)29-3)13-21(28,22(24,25)26)12-16-10-14-6-4-5-7-18(14)27-16/h4-11,27-28H,12-13H2,1-3H3/t21-/m1/s1
n/an/a 87n/an/an/an/an/an/a
Boehringer Ingelheim Pharmaceuticals
Curated by ChEMBL
Assay Description
Agonist activity at glucocorticoid receptor in HFF assessed as inhibition of IL1-induced IL-6 production after 18 to 24 hrs
Bioorg Med Chem Lett 21: 6842-51 (2011)
Article DOI: 10.1016/j.bmcl.2011.09.018
BindingDB Entry DOI: 10.7270/Q2CV4J51
Mineralocorticoid receptor
(Homo sapiens (Human))
BDBM50356037
(CHEMBL1911543)
Show SMILES COc1ccc(F)cc1C(C)(C)C[C@](O)(Cc1cc2ccccc2[nH]1)C(F)(F)F |r|
Show InChI InChI=1S/C22H23F4NO2/c1-20(2,17-11-15(23)8-9-19(17)29-3)13-21(28,22(24,25)26)12-16-10-14-6-4-5-7-18(14)27-16/h4-11,27-28H,12-13H2,1-3H3/t21-/m1/s1
n/an/a 1.10E+3n/an/an/an/an/an/a
Boehringer Ingelheim Pharmaceuticals
Curated by ChEMBL
Assay Description
Displacement of tetramethylrhodamine-labeled Dexamethasone from human recombinant mineralocorticoid receptor expressed in baculovirus infected insect...
Bioorg Med Chem Lett 21: 6842-51 (2011)
Article DOI: 10.1016/j.bmcl.2011.09.018
BindingDB Entry DOI: 10.7270/Q2CV4J51