BDBM50356049 CHEMBL1911649
SMILES: COc1ccc(F)cc1C(C)(C)CC(O)(Cc1cc2cc(ccc2[nH]1)C#N)C(F)(F)F
InChI Key: InChIKey=DORQSUNHACTGLQ-UHFFFAOYSA-N
Data: 4 IC50  1 EC50
Activity Spreadsheet -- Enzyme Inhibition Constant Data from BindingDB
Found 5 hits for monomerid = 50356049
Trg + Lig
Ki
nM
ΔG°
kcal/mole
IC50
nM
Kd
nM
EC50/IC50
nM
koff
s-1
kon
M-1s-1
pHTemp
°C
Glucocorticoid receptor
(Homo sapiens (Human))
BDBM50356049
(CHEMBL1911649)
Show SMILES COc1ccc(F)cc1C(C)(C)CC(O)(Cc1cc2cc(ccc2[nH]1)C#N)C(F)(F)F
Show InChI InChI=1S/C23H22F4N2O2/c1-21(2,18-10-16(24)5-7-20(18)31-3)13-22(30,23(25,26)27)11-17-9-15-8-14(12-28)4-6-19(15)29-17/h4-10,29-30H,11,13H2,1-3H3
n/an/a 8n/an/an/an/an/an/a
Boehringer Ingelheim Pharmaceuticals
Curated by ChEMBL
Assay Description
Displacement of tetramethylrhodamine-labeled Dexamethasone from human recombinant glucocorticoid receptor expressed in baculovirus infected insect ce...
Bioorg Med Chem Lett 21: 6842-51 (2011)
Article DOI: 10.1016/j.bmcl.2011.09.018
BindingDB Entry DOI: 10.7270/Q2CV4J51
Glucocorticoid receptor
(Homo sapiens (Human))
BDBM50356049
(CHEMBL1911649)
Show SMILES COc1ccc(F)cc1C(C)(C)CC(O)(Cc1cc2cc(ccc2[nH]1)C#N)C(F)(F)F
Show InChI InChI=1S/C23H22F4N2O2/c1-21(2,18-10-16(24)5-7-20(18)31-3)13-22(30,23(25,26)27)11-17-9-15-8-14(12-28)4-6-19(15)29-17/h4-10,29-30H,11,13H2,1-3H3
n/an/an/an/a 28n/an/an/an/a
Boehringer Ingelheim Pharmaceuticals
Curated by ChEMBL
Assay Description
Transactivation activity of glucocorticoid receptor in HFF assessed as induction of aromatase activity by measuring beta-estradiol activity after 18 ...
Bioorg Med Chem Lett 21: 6842-51 (2011)
Article DOI: 10.1016/j.bmcl.2011.09.018
BindingDB Entry DOI: 10.7270/Q2CV4J51
Glucocorticoid receptor
(Homo sapiens (Human))
BDBM50356049
(CHEMBL1911649)
Show SMILES COc1ccc(F)cc1C(C)(C)CC(O)(Cc1cc2cc(ccc2[nH]1)C#N)C(F)(F)F
Show InChI InChI=1S/C23H22F4N2O2/c1-21(2,18-10-16(24)5-7-20(18)31-3)13-22(30,23(25,26)27)11-17-9-15-8-14(12-28)4-6-19(15)29-17/h4-10,29-30H,11,13H2,1-3H3
n/an/a 11n/an/an/an/an/an/a
Boehringer Ingelheim Pharmaceuticals
Curated by ChEMBL
Assay Description
Agonist activity at glucocorticoid receptor in HFF assessed as inhibition of IL1-induced IL-6 production after 18 to 24 hrs
Bioorg Med Chem Lett 21: 6842-51 (2011)
Article DOI: 10.1016/j.bmcl.2011.09.018
BindingDB Entry DOI: 10.7270/Q2CV4J51
Mineralocorticoid receptor
(Homo sapiens (Human))
BDBM50356049
(CHEMBL1911649)
Show SMILES COc1ccc(F)cc1C(C)(C)CC(O)(Cc1cc2cc(ccc2[nH]1)C#N)C(F)(F)F
Show InChI InChI=1S/C23H22F4N2O2/c1-21(2,18-10-16(24)5-7-20(18)31-3)13-22(30,23(25,26)27)11-17-9-15-8-14(12-28)4-6-19(15)29-17/h4-10,29-30H,11,13H2,1-3H3
n/an/a 415n/an/an/an/an/an/a
Boehringer Ingelheim Pharmaceuticals
Curated by ChEMBL
Assay Description
Displacement of tetramethylrhodamine-labeled Dexamethasone from human recombinant mineralocorticoid receptor expressed in baculovirus infected insect...
Bioorg Med Chem Lett 21: 6842-51 (2011)
Article DOI: 10.1016/j.bmcl.2011.09.018
BindingDB Entry DOI: 10.7270/Q2CV4J51
Progesterone receptor
(Homo sapiens (Human))
BDBM50356049
(CHEMBL1911649)
Show SMILES COc1ccc(F)cc1C(C)(C)CC(O)(Cc1cc2cc(ccc2[nH]1)C#N)C(F)(F)F
Show InChI InChI=1S/C23H22F4N2O2/c1-21(2,18-10-16(24)5-7-20(18)31-3)13-22(30,23(25,26)27)11-17-9-15-8-14(12-28)4-6-19(15)29-17/h4-10,29-30H,11,13H2,1-3H3
n/an/a 815n/an/an/an/an/an/a
Boehringer Ingelheim Pharmaceuticals
Curated by ChEMBL
Assay Description
Displacement of tetramethylrhodamine-labeled RU-486 from human recombinant progesterone receptor expressed in baculovirus infected insect cells by fl...
Bioorg Med Chem Lett 21: 6842-51 (2011)
Article DOI: 10.1016/j.bmcl.2011.09.018
BindingDB Entry DOI: 10.7270/Q2CV4J51