BDBM50356482 CHEMBL1911982
SMILES: Cc1cc(CNC(=O)NCCc2ccc3OCOc3c2)nc(n1)-n1ccnc1
InChI Key: InChIKey=SQYOWEOTRJJNTN-UHFFFAOYSA-N
Data: 3 EC50
Activity Spreadsheet -- Enzyme Inhibition Constant Data from BindingDB
Found 3 hits for monomerid = 50356482
Trg + Lig
Ki
nM
ΔG°
kcal/mole
IC50
nM
Kd
nM
EC50/IC50
nM
koff
s-1
kon
M-1s-1
pHTemp
°C
Nitric oxide synthase, inducible
(Homo sapiens (Human))
BDBM50356482
(CHEMBL1911982)
Show SMILES Cc1cc(CNC(=O)NCCc2ccc3OCOc3c2)nc(n1)-n1ccnc1
Show InChI InChI=1S/C19H20N6O3/c1-13-8-15(24-18(23-13)25-7-6-20-11-25)10-22-19(26)21-5-4-14-2-3-16-17(9-14)28-12-27-16/h2-3,6-9,11H,4-5,10,12H2,1H3,(H2,21,22,26)
NCI pathway
Reactome pathway
n/an/an/an/a 14n/an/an/an/a
Kalypsys Inc.
Curated by ChEMBL
Assay Description
Inhibition of human iNOS expressed in human HEK293 cells assessed as nitrite accumulation after 18 hrs by 2,3-diaminonapthalene assay
Bioorg Med Chem Lett 21: 6888-94 (2011)
Article DOI: 10.1016/j.bmcl.2011.08.112
BindingDB Entry DOI: 10.7270/Q2XK8FXC
Nitric oxide synthase, endothelial
(Homo sapiens (Human))
BDBM50356482
(CHEMBL1911982)
Show SMILES Cc1cc(CNC(=O)NCCc2ccc3OCOc3c2)nc(n1)-n1ccnc1
Show InChI InChI=1S/C19H20N6O3/c1-13-8-15(24-18(23-13)25-7-6-20-11-25)10-22-19(26)21-5-4-14-2-3-16-17(9-14)28-12-27-16/h2-3,6-9,11H,4-5,10,12H2,1H3,(H2,21,22,26)
n/an/an/an/a>1.00E+5n/an/an/an/a
Kalypsys Inc.
Curated by ChEMBL
Assay Description
Inhibition of human eNOS expressed in HEK293 cells assessed as inhibition A23187-induced nitric oxide production incubated for 24 hrs measured after ...
Bioorg Med Chem Lett 21: 6888-94 (2011)
Article DOI: 10.1016/j.bmcl.2011.08.112
BindingDB Entry DOI: 10.7270/Q2XK8FXC
Nitric oxide synthase, brain
(Homo sapiens (Human))
BDBM50356482
(CHEMBL1911982)
Show SMILES Cc1cc(CNC(=O)NCCc2ccc3OCOc3c2)nc(n1)-n1ccnc1
Show InChI InChI=1S/C19H20N6O3/c1-13-8-15(24-18(23-13)25-7-6-20-11-25)10-22-19(26)21-5-4-14-2-3-16-17(9-14)28-12-27-16/h2-3,6-9,11H,4-5,10,12H2,1H3,(H2,21,22,26)
Reactome pathway
n/an/an/an/a>1.00E+5n/an/an/an/a
Kalypsys Inc.
Curated by ChEMBL
Assay Description
Inhibition of human nNOS expressed in HEK293 cells assessed as inhibition ionomycin-induced nitric oxide production incubated for 24 hrs measured aft...
Bioorg Med Chem Lett 21: 6888-94 (2011)
Article DOI: 10.1016/j.bmcl.2011.08.112
BindingDB Entry DOI: 10.7270/Q2XK8FXC