null
SMILES: OC(CN(C(=O)c1ccc(Cl)c(Cl)c1)c1ccccc1)Cn1c2ccccc2c2ccccc12
InChI Key: InChIKey=RNXCAXMTOYHQBD-UHFFFAOYSA-N
Activity Spreadsheet -- Enzyme Inhibition Constant Data from BindingDB
Found 1 hit for monomerid = 50356525
Trg + Lig
Ki
nM
ΔG°
kcal/mole
IC50
nM
Kd
nM
EC50/IC50
nM
koff
s-1
kon
M-1s-1
pHTemp
°C
Beta-secretase 1
(Homo sapiens (Human))
BDBM50356525
(CHEMBL1909686)
Show SMILES OC(CN(C(=O)c1ccc(Cl)c(Cl)c1)c1ccccc1)Cn1c2ccccc2c2ccccc12
Show InChI InChI=1S/C28H22Cl2N2O2/c29-24-15-14-19(16-25(24)30)28(34)31(20-8-2-1-3-9-20)17-21(33)18-32-26-12-6-4-10-22(26)23-11-5-7-13-27(23)32/h1-16,21,33H,17-18H2
n/an/a 2.50E+3n/an/an/an/an/an/a
Universit£ di Pisa
Curated by ChEMBL
Assay Description
Inhibition of BACE1 by fluorescence-based assay
Bioorg Med Chem Lett 21: 6657-61 (2011)
Article DOI: 10.1016/j.bmcl.2011.09.064
BindingDB Entry DOI: 10.7270/Q2ST7Q7H