BDBM50356528 CHEMBL1909689
SMILES: OC(CN(C(=O)c1ccccc1)c1ccc(Cl)cc1)Cn1c2ccccc2c2ccccc12
InChI Key: InChIKey=FYULGPMPZOUQPJ-UHFFFAOYSA-N
Data: 1 IC50
Activity Spreadsheet -- Enzyme Inhibition Constant Data from BindingDB
Found 1 hit for monomerid = 50356528
Trg + Lig
Ki
nM
ΔG°
kcal/mole
IC50
nM
Kd
nM
EC50/IC50
nM
koff
s-1
kon
M-1s-1
pHTemp
°C
Beta-secretase 1
(Homo sapiens (Human))
BDBM50356528
(CHEMBL1909689)
Show SMILES OC(CN(C(=O)c1ccccc1)c1ccc(Cl)cc1)Cn1c2ccccc2c2ccccc12
Show InChI InChI=1S/C28H23ClN2O2/c29-21-14-16-22(17-15-21)30(28(33)20-8-2-1-3-9-20)18-23(32)19-31-26-12-6-4-10-24(26)25-11-5-7-13-27(25)31/h1-17,23,32H,18-19H2
n/an/a>1.00E+4n/an/an/an/an/an/a
Universit£ di Pisa
Curated by ChEMBL
Assay Description
Inhibition of BACE1 by fluorescence-based assay
Bioorg Med Chem Lett 21: 6657-61 (2011)
Article DOI: 10.1016/j.bmcl.2011.09.064
BindingDB Entry DOI: 10.7270/Q2ST7Q7H