BDBM50356682 CHEMBL1917597
SMILES: CN(C)S(=O)(=O)c1ccc(C)c(c1)C#Cc1cc(Cl)ccc1OCC(O)=O
InChI Key: InChIKey=BOLWIGKCJJPSMH-UHFFFAOYSA-N
Data: 1 KI  1 IC50
Activity Spreadsheet -- Enzyme Inhibition Constant Data from BindingDB
Found 2 hits for monomerid = 50356682
Trg + Lig
Ki
nM
ΔG°
kcal/mole
IC50
nM
Kd
nM
EC50/IC50
nM
koff
s-1
kon
M-1s-1
pHTemp
°C
G protein-coupled receptor 44
(Homo sapiens (Human))
BDBM50356682
(CHEMBL1917597)
Show SMILES CN(C)S(=O)(=O)c1ccc(C)c(c1)C#Cc1cc(Cl)ccc1OCC(O)=O
Show InChI InChI=1S/C19H18ClNO5S/c1-13-4-8-17(27(24,25)21(2)3)11-14(13)5-6-15-10-16(20)7-9-18(15)26-12-19(22)23/h4,7-11H,12H2,1-3H3,(H,22,23)
Reactome pathway
5n/an/an/an/an/an/an/an/a
Merck Serono S.A.
Curated by ChEMBL
Assay Description
Displacement of [3H]PGD2 from human CRTH2 expressed in chinese hamster CHO cells by liquid scintillation counting
J Med Chem 54: 7299-317 (2011)
Article DOI: 10.1021/jm200866y
BindingDB Entry DOI: 10.7270/Q2N58MS1
G protein-coupled receptor 44
(Homo sapiens (Human))
BDBM50356682
(CHEMBL1917597)
Show SMILES CN(C)S(=O)(=O)c1ccc(C)c(c1)C#Cc1cc(Cl)ccc1OCC(O)=O
Show InChI InChI=1S/C19H18ClNO5S/c1-13-4-8-17(27(24,25)21(2)3)11-14(13)5-6-15-10-16(20)7-9-18(15)26-12-19(22)23/h4,7-11H,12H2,1-3H3,(H,22,23)
Reactome pathway
n/an/a 77n/an/an/an/an/an/a
Merck Serono S.A.
Curated by ChEMBL
Assay Description
Antagonist activity at CRTH2 in human blood cells assessed as inhibition of PGD2-induced eosinophil cell shape change after 10 mins by flow cytometry
J Med Chem 54: 7299-317 (2011)
Article DOI: 10.1021/jm200866y
BindingDB Entry DOI: 10.7270/Q2N58MS1