BDBM50356990 CHEMBL1916246
SMILES: Cc1nnc(o1)C(=O)N[C@H]1C(C)(C)[C@H](Oc2ccc(C#N)c(Cl)c2)C1(C)C
InChI Key: InChIKey=KQSSBUAGCHWZQA-QAQDUYKDSA-N
Data: 1 IC50
Activity Spreadsheet -- Enzyme Inhibition Constant Data from BindingDB
Found 1 hit for monomerid = 50356990
Trg + Lig
Ki
nM
ΔG°
kcal/mole
IC50
nM
Kd
nM
EC50/IC50
nM
koff
s-1
kon
M-1s-1
pHTemp
°C
Androgen Receptor
(Homo sapiens (Human))
BDBM50356990
(CHEMBL1916246)
Show SMILES Cc1nnc(o1)C(=O)N[C@H]1C(C)(C)[C@H](Oc2ccc(C#N)c(Cl)c2)C1(C)C |r,wU:9.9,wD:13.14,(2.34,-36.66,;.8,-36.67,;-.09,-37.93,;-1.56,-37.47,;-1.58,-35.94,;-.12,-35.44,;-2.93,-35.19,;-4.25,-35.99,;-2.96,-33.65,;-4.31,-32.91,;-5.85,-32.91,;-6.26,-34.39,;-7.35,-33.3,;-5.85,-31.37,;-7.18,-30.59,;-7.17,-29.05,;-8.5,-28.29,;-8.51,-26.75,;-7.17,-25.98,;-7.16,-24.44,;-7.15,-22.91,;-5.83,-26.75,;-4.5,-25.99,;-5.84,-28.29,;-4.31,-31.37,;-3.92,-29.87,;-2.83,-31.76,)|
Show InChI InChI=1S/C19H21ClN4O3/c1-10-23-24-15(26-10)14(25)22-16-18(2,3)17(19(16,4)5)27-12-7-6-11(9-21)13(20)8-12/h6-8,16-17H,1-5H3,(H,22,25)/t16-,17-
NCI pathway
Reactome pathway
n/an/a 30n/an/an/an/an/an/a
Pfizer Inc.
Curated by ChEMBL
Assay Description
Antagonist activity at human AR overexpressed in human LNCAP cells by luciferase reporter gene assay
J Med Chem 54: 7693-704 (2011)
Article DOI: 10.1021/jm201059s
BindingDB Entry DOI: 10.7270/Q2348KS9