BDBM50357017 CHEMBL1916839
SMILES: CC(C)CCN([C@H](C(C)C)C(=O)NO)S(=O)(=O)c1ccc2OCCc2c1
InChI Key: InChIKey=OOUAVDQEGOBVOR-QGZVFWFLSA-N
Data: 2 IC50
Activity Spreadsheet -- Enzyme Inhibition Constant Data from BindingDB
Found 2 hits for monomerid = 50357017
Trg + Lig
Ki
nM
ΔG°
kcal/mole
IC50
nM
Kd
nM
EC50/IC50
nM
koff
s-1
kon
M-1s-1
pHTemp
°C
Collagenase 3
(Homo sapiens (Human))
BDBM50357017
(CHEMBL1916839)
Show SMILES CC(C)CCN([C@H](C(C)C)C(=O)NO)S(=O)(=O)c1ccc2OCCc2c1 |r|
Show InChI InChI=1S/C18H28N2O5S/c1-12(2)7-9-20(17(13(3)4)18(21)19-22)26(23,24)15-5-6-16-14(11-15)8-10-25-16/h5-6,11-13,17,22H,7-10H2,1-4H3,(H,19,21)/t17-/m1/s1
NCI pathway
Reactome pathway
n/an/a 0.600n/an/an/an/an/an/a
Novartis Institutes for Biomedical Research
Curated by ChEMBL
Assay Description
Inhibition of MMP13
Bioorg Med Chem Lett 21: 6440-5 (2011)
Article DOI: 10.1016/j.bmcl.2011.08.087
BindingDB Entry DOI: 10.7270/Q2TQ61ZJ
72 kDa type IV collagenase
(Homo sapiens (Human))
BDBM50357017
(CHEMBL1916839)
Show SMILES CC(C)CCN([C@H](C(C)C)C(=O)NO)S(=O)(=O)c1ccc2OCCc2c1 |r|
Show InChI InChI=1S/C18H28N2O5S/c1-12(2)7-9-20(17(13(3)4)18(21)19-22)26(23,24)15-5-6-16-14(11-15)8-10-25-16/h5-6,11-13,17,22H,7-10H2,1-4H3,(H,19,21)/t17-/m1/s1
Reactome pathway
n/an/a 10n/an/an/an/an/an/a
Novartis Institutes for Biomedical Research
Curated by ChEMBL
Assay Description
Inhibition of MMP2
Bioorg Med Chem Lett 21: 6440-5 (2011)
Article DOI: 10.1016/j.bmcl.2011.08.087
BindingDB Entry DOI: 10.7270/Q2TQ61ZJ