BDBM50357064 CHEMBL1917231
SMILES: CN1CCC[C@H]1[C@@H]1COc2ccc(O)cc2O1
InChI Key: InChIKey=OHYANMWFAIMESB-GWCFXTLKSA-N
Data: 1 KI  1 EC50
Activity Spreadsheet -- Enzyme Inhibition Constant Data from BindingDB
Found 9 hits for monomerid = 50357064
Trg + Lig
Ki
nM
ΔG°
kcal/mole
IC50
nM
Kd
nM
EC50/IC50
nM
koff
s-1
kon
M-1s-1
pHTemp
°C
Neuronal acetylcholine receptor Alpha-4/Beta-2
(Homo sapiens (Human))
BDBM50357064
(CHEMBL1917231)
Show SMILES CN1CCC[C@H]1[C@@H]1COc2ccc(O)cc2O1 |r|
Show InChI InChI=1S/C13H17NO3/c1-14-6-2-3-10(14)13-8-16-11-5-4-9(15)7-12(11)17-13/h4-5,7,10,13,15H,2-3,6,8H2,1H3/t10-,13-/m0/s1
NCI pathway
Reactome pathway
6.70n/an/an/an/an/an/an/an/a
TBA
Citation and Details
Neuronal acetylcholine receptor protein alpha-4/beta-2 subunit
(Rattus norvegicus (Rat))
BDBM50357064
(CHEMBL1917231)
Show SMILES CN1CCC[C@H]1[C@@H]1COc2ccc(O)cc2O1 |r|
Show InChI InChI=1S/C13H17NO3/c1-14-6-2-3-10(14)13-8-16-11-5-4-9(15)7-12(11)17-13/h4-5,7,10,13,15H,2-3,6,8H2,1H3/t10-,13-/m0/s1
12n/an/an/an/an/an/an/an/a
TBA
Citation and Details
Neuronal acetylcholine receptor; alpha3/beta4
(Homo sapiens (Human))
BDBM50357064
(CHEMBL1917231)
Show SMILES CN1CCC[C@H]1[C@@H]1COc2ccc(O)cc2O1 |r|
Show InChI InChI=1S/C13H17NO3/c1-14-6-2-3-10(14)13-8-16-11-5-4-9(15)7-12(11)17-13/h4-5,7,10,13,15H,2-3,6,8H2,1H3/t10-,13-/m0/s1
310n/an/an/an/an/an/an/an/a
TBA
Citation and Details
Neuronal acetylcholine receptor
(Rattus norvegicus (Rat))
BDBM50357064
(CHEMBL1917231)
Show SMILES CN1CCC[C@H]1[C@@H]1COc2ccc(O)cc2O1 |r|
Show InChI InChI=1S/C13H17NO3/c1-14-6-2-3-10(14)13-8-16-11-5-4-9(15)7-12(11)17-13/h4-5,7,10,13,15H,2-3,6,8H2,1H3/t10-,13-/m0/s1
Reactome pathway
427n/an/an/an/an/an/an/an/a
Universit£ degli Studi di Milano
Curated by ChEMBL
Assay Description
Displacement of [125I]alpha-bungarotoxin from alpha7 nAChR in Sprague-Dawley rat cerebral cortex by beta counting
J Med Chem 54: 7588-601 (2011)
Article DOI: 10.1021/jm200937t
BindingDB Entry DOI: 10.7270/Q2K64JGC
Neuronal acetylcholine receptor
(Rattus norvegicus (Rat))
BDBM50357064
(CHEMBL1917231)
Show SMILES CN1CCC[C@H]1[C@@H]1COc2ccc(O)cc2O1 |r|
Show InChI InChI=1S/C13H17NO3/c1-14-6-2-3-10(14)13-8-16-11-5-4-9(15)7-12(11)17-13/h4-5,7,10,13,15H,2-3,6,8H2,1H3/t10-,13-/m0/s1
Reactome pathway
430n/an/an/an/an/an/an/an/a
TBA
Citation and Details
Neuronal acetylcholine receptor Alpha-4/Beta-2
(Homo sapiens (Human))
BDBM50357064
(CHEMBL1917231)
Show SMILES CN1CCC[C@H]1[C@@H]1COc2ccc(O)cc2O1 |r|
Show InChI InChI=1S/C13H17NO3/c1-14-6-2-3-10(14)13-8-16-11-5-4-9(15)7-12(11)17-13/h4-5,7,10,13,15H,2-3,6,8H2,1H3/t10-,13-/m0/s1
NCI pathway
Reactome pathway
n/an/an/an/a 300n/an/an/an/a
TBA
Citation and Details
Neuronal acetylcholine receptor Alpha-4/Beta-2
(Homo sapiens (Human))
BDBM50357064
(CHEMBL1917231)
Show SMILES CN1CCC[C@H]1[C@@H]1COc2ccc(O)cc2O1 |r|
Show InChI InChI=1S/C13H17NO3/c1-14-6-2-3-10(14)13-8-16-11-5-4-9(15)7-12(11)17-13/h4-5,7,10,13,15H,2-3,6,8H2,1H3/t10-,13-/m0/s1
NCI pathway
Reactome pathway
n/an/an/an/a 3.80E+3n/an/an/an/a
TBA
Citation and Details
Neuronal acetylcholine receptor Alpha-4/Beta-2
(Homo sapiens (Human))
BDBM50357064
(CHEMBL1917231)
Show SMILES CN1CCC[C@H]1[C@@H]1COc2ccc(O)cc2O1 |r|
Show InChI InChI=1S/C13H17NO3/c1-14-6-2-3-10(14)13-8-16-11-5-4-9(15)7-12(11)17-13/h4-5,7,10,13,15H,2-3,6,8H2,1H3/t10-,13-/m0/s1
NCI pathway
Reactome pathway
n/an/an/an/a 300n/an/an/an/a
Universit£ degli Studi di Milano
Curated by ChEMBL
Assay Description
Agonist activity at human alpha4beta2 nAChR expressed in rat GH4C1 cells assessed as induction of peak current amplitude at holding potential of -70 ...
J Med Chem 58: 6665-77 (2015)
BindingDB Entry DOI: 10.7270/Q2CF9RX4
Neuronal acetylcholine receptor; alpha3/beta4
(Homo sapiens (Human))
BDBM50357064
(CHEMBL1917231)
Show SMILES CN1CCC[C@H]1[C@@H]1COc2ccc(O)cc2O1 |r|
Show InChI InChI=1S/C13H17NO3/c1-14-6-2-3-10(14)13-8-16-11-5-4-9(15)7-12(11)17-13/h4-5,7,10,13,15H,2-3,6,8H2,1H3/t10-,13-/m0/s1
n/an/an/an/a 1.70E+4n/an/an/an/a
TBA
Citation and Details