BDBM50357261 CHEMBL1916296
SMILES: CCCOCCn1c2cc(ncc2c(nc1=O)N1CCN(CCO)CC1)-c1ccc(OC)nc1
InChI Key: InChIKey=MSUPBXMQAKEHAA-UHFFFAOYSA-N
Data: 1 IC50
Activity Spreadsheet -- Enzyme Inhibition Constant Data from BindingDB
Found 1 hit for monomerid = 50357261
Trg + Lig
Ki
nM
ΔG°
kcal/mole
IC50
nM
Kd
nM
EC50/IC50
nM
koff
s-1
kon
M-1s-1
pHTemp
°C
cGMP-specific 3',5'-cyclic phosphodiesterase
(Homo sapiens (Human))
BDBM50357261
(CHEMBL1916296)
Show SMILES CCCOCCn1c2cc(ncc2c(nc1=O)N1CCN(CCO)CC1)-c1ccc(OC)nc1
Show InChI InChI=1S/C24H32N6O4/c1-3-13-34-14-11-30-21-15-20(18-4-5-22(33-2)26-16-18)25-17-19(21)23(27-24(30)32)29-8-6-28(7-9-29)10-12-31/h4-5,15-17,31H,3,6-14H2,1-2H3
Reactome pathway
n/an/a 1.40n/an/an/an/an/an/a
Pfizer Inc.
Curated by ChEMBL
Assay Description
Inhibition of PDE5
Bioorg Med Chem Lett 21: 6348-52 (2011)
Article DOI: 10.1016/j.bmcl.2011.08.106
BindingDB Entry DOI: 10.7270/Q2J67HB0