BDBM50357335 CHEMBL1916893
SMILES: CN(C)C\C=C\C(=O)N(C)c1cc2c(cc1F)nc(Nc1cc(F)ccc1C)c1cncn21
InChI Key: InChIKey=XBNKECOROHQBKB-AATRIKPKSA-N
Data: 2 IC50
Activity Spreadsheet -- Enzyme Inhibition Constant Data from BindingDB
Found 2 hits for monomerid = 50357335
Trg + Lig
Ki
nM
ΔG°
kcal/mole
IC50
nM
Kd
nM
EC50/IC50
nM
koff
s-1
kon
M-1s-1
pHTemp
°C
Tyrosine-protein kinase Lyn
(Homo sapiens (Human))
BDBM50357335
(CHEMBL1916893)
Show SMILES CN(C)C\C=C\C(=O)N(C)c1cc2c(cc1F)nc(Nc1cc(F)ccc1C)c1cncn21
Show InChI InChI=1S/C24H24F2N6O/c1-15-7-8-16(25)10-18(15)28-24-22-13-27-14-32(22)21-12-20(17(26)11-19(21)29-24)31(4)23(33)6-5-9-30(2)3/h5-8,10-14H,9H2,1-4H3,(H,28,29)/b6-5+
Reactome pathway
n/an/a 3.08E+3n/an/an/an/an/an/a
Pfizer Inc.
Curated by ChEMBL
Assay Description
Inhibition of LYN-A expressed in Sf9 cells after 60 mins by TR-FRET Assay
Bioorg Med Chem Lett 21: 6258-63 (2011)
Article DOI: 10.1016/j.bmcl.2011.09.008
BindingDB Entry DOI: 10.7270/Q21836XD
Tyrosine-protein kinase BTK
(Homo sapiens (Human))
BDBM50357335
(CHEMBL1916893)
Show SMILES CN(C)C\C=C\C(=O)N(C)c1cc2c(cc1F)nc(Nc1cc(F)ccc1C)c1cncn21
Show InChI InChI=1S/C24H24F2N6O/c1-15-7-8-16(25)10-18(15)28-24-22-13-27-14-32(22)21-12-20(17(26)11-19(21)29-24)31(4)23(33)6-5-9-30(2)3/h5-8,10-14H,9H2,1-4H3,(H,28,29)/b6-5+
NCI pathway
Reactome pathway
n/an/a 6.76n/an/an/an/an/an/a
Pfizer Inc.
Curated by ChEMBL
Assay Description
Inhibition of human full-length BTK expressed in Sf9 cells using FAM-Srctide peptide as substrate after 60 mins by TR-FRET Assay
Bioorg Med Chem Lett 21: 6258-63 (2011)
Article DOI: 10.1016/j.bmcl.2011.09.008
BindingDB Entry DOI: 10.7270/Q21836XD