BDBM50357547 CHEMBL1915403
SMILES: OC(=O)[C@@H]1Cc2c(CN1Cc1ccc(O)cc1)[nH]c1ccccc21
InChI Key: InChIKey=FWSRKMKBCXSLMT-SFHVURJKSA-N
Data: 1 IC50
Activity Spreadsheet -- Enzyme Inhibition Constant Data from BindingDB
Found 1 hit for monomerid = 50357547
Trg + Lig
Ki
nM
ΔG°
kcal/mole
IC50
nM
Kd
nM
EC50/IC50
nM
koff
s-1
kon
M-1s-1
pHTemp
°C
Cytochrome P450 19A1
(Homo sapiens (Human))
BDBM50357547
(CHEMBL1915403)
Show SMILES OC(=O)[C@@H]1Cc2c(CN1Cc1ccc(O)cc1)[nH]c1ccccc21 |r|
Show InChI InChI=1S/C19H18N2O3/c22-13-7-5-12(6-8-13)10-21-11-17-15(9-18(21)19(23)24)14-3-1-2-4-16(14)20-17/h1-8,18,20,22H,9-11H2,(H,23,24)/t18-/m0/s1
Reactome pathway
n/an/a 1.05E+4n/an/an/an/an/an/a
University of Hawai'i at Hilo
Curated by ChEMBL
Assay Description
Inhibition of aromatase after 10 mins preincubation by plate reader relative to control
Bioorg Med Chem 19: 6182-95 (2011)
Article DOI: 10.1016/j.bmc.2011.09.020
BindingDB Entry DOI: 10.7270/Q2Z89CTS