BDBM50357622 CHEMBL1915672
SMILES: CN1C[C@@H](COc2cc(C)c(C(=O)Nc3cccc(CC(O)=O)c3)c(C)c2)Oc2ccccc12
InChI Key: InChIKey=BTRINOSIFKLWFT-QFIPXVFZSA-N
Data: 1 KI  1 IC50
Activity Spreadsheet -- Enzyme Inhibition Constant Data from BindingDB
Found 2 hits for monomerid = 50357622
Trg + Lig
Ki
nM
ΔG°
kcal/mole
IC50
nM
Kd
nM
EC50/IC50
nM
koff
s-1
kon
M-1s-1
pHTemp
°C
Prostanoid IP receptor
(Homo sapiens (Human))
BDBM50357622
(CHEMBL1915672)
Show SMILES CN1C[C@@H](COc2cc(C)c(C(=O)Nc3cccc(CC(O)=O)c3)c(C)c2)Oc2ccccc12 |r|
Show InChI InChI=1S/C27H28N2O5/c1-17-11-21(33-16-22-15-29(3)23-9-4-5-10-24(23)34-22)12-18(2)26(17)27(32)28-20-8-6-7-19(13-20)14-25(30)31/h4-13,22H,14-16H2,1-3H3,(H,28,32)(H,30,31)/t22-/m0/s1
NCI pathway
Reactome pathway
>1.00E+4n/an/an/an/an/an/an/an/a
Ono Pharmaceutical Co., Ltd
Curated by ChEMBL
Assay Description
Displacement of [3H]Iloprost from human prostanoid IP receptor expressed in CHO cells after 30 mins by liquid scintillation counting
Bioorg Med Chem 19: 6935-48 (2011)
Article DOI: 10.1016/j.bmc.2011.08.065
BindingDB Entry DOI: 10.7270/Q2K35V22
Prostanoid DP receptor
(Mus musculus)
BDBM50357622
(CHEMBL1915672)
Show SMILES CN1C[C@@H](COc2cc(C)c(C(=O)Nc3cccc(CC(O)=O)c3)c(C)c2)Oc2ccccc12 |r|
Show InChI InChI=1S/C27H28N2O5/c1-17-11-21(33-16-22-15-29(3)23-9-4-5-10-24(23)34-22)12-18(2)26(17)27(32)28-20-8-6-7-19(13-20)14-25(30)31/h4-13,22H,14-16H2,1-3H3,(H,28,32)(H,30,31)/t22-/m0/s1
Reactome pathway
n/an/a 3.5n/an/an/an/an/an/a
Ono Pharmaceutical Co., Ltd
Curated by ChEMBL
Assay Description
Antagonist activity at mouse prostanoid DP receptor expressed in CHO cells assessed as inhibition of PGD2-induced intracellular cAMP production after...
Bioorg Med Chem 19: 6935-48 (2011)
Article DOI: 10.1016/j.bmc.2011.08.065
BindingDB Entry DOI: 10.7270/Q2K35V22