BDBM50357630 CHEMBL1915859
SMILES: Cc1cc(OC[C@@H]2Cc3ccccc3O2)cc(C)c1C(=O)Nc1cc(CC(O)=O)ccc1Cl
InChI Key: InChIKey=KYIOSDHREIOMNK-FQEVSTJZSA-N
Data: 1 KI  1 IC50
Activity Spreadsheet -- Enzyme Inhibition Constant Data from BindingDB
Found 2 hits for monomerid = 50357630
Trg + Lig
Ki
nM
ΔG°
kcal/mole
IC50
nM
Kd
nM
EC50/IC50
nM
koff
s-1
kon
M-1s-1
pHTemp
°C
Prostanoid IP receptor
(Homo sapiens (Human))
BDBM50357630
(CHEMBL1915859)
Show SMILES Cc1cc(OC[C@@H]2Cc3ccccc3O2)cc(C)c1C(=O)Nc1cc(CC(O)=O)ccc1Cl |r|
Show InChI InChI=1S/C26H24ClNO5/c1-15-9-19(32-14-20-13-18-5-3-4-6-23(18)33-20)10-16(2)25(15)26(31)28-22-11-17(12-24(29)30)7-8-21(22)27/h3-11,20H,12-14H2,1-2H3,(H,28,31)(H,29,30)/t20-/m0/s1
NCI pathway
Reactome pathway
>1.00E+4n/an/an/an/an/an/an/an/a
Ono Pharmaceutical Co., Ltd
Curated by ChEMBL
Assay Description
Displacement of [3H]Iloprost from human prostanoid IP receptor expressed in CHO cells after 30 mins by liquid scintillation counting
Bioorg Med Chem 19: 6935-48 (2011)
Article DOI: 10.1016/j.bmc.2011.08.065
BindingDB Entry DOI: 10.7270/Q2K35V22
Prostanoid DP receptor
(Mus musculus)
BDBM50357630
(CHEMBL1915859)
Show SMILES Cc1cc(OC[C@@H]2Cc3ccccc3O2)cc(C)c1C(=O)Nc1cc(CC(O)=O)ccc1Cl |r|
Show InChI InChI=1S/C26H24ClNO5/c1-15-9-19(32-14-20-13-18-5-3-4-6-23(18)33-20)10-16(2)25(15)26(31)28-22-11-17(12-24(29)30)7-8-21(22)27/h3-11,20H,12-14H2,1-2H3,(H,28,31)(H,29,30)/t20-/m0/s1
Reactome pathway
n/an/a 14n/an/an/an/an/an/a
Ono Pharmaceutical Co., Ltd
Curated by ChEMBL
Assay Description
Antagonist activity at mouse prostanoid DP receptor expressed in CHO cells assessed as inhibition of PGD2-induced intracellular cAMP production after...
Bioorg Med Chem 19: 6935-48 (2011)
Article DOI: 10.1016/j.bmc.2011.08.065
BindingDB Entry DOI: 10.7270/Q2K35V22