BDBM50357772 CHEMBL1916409
SMILES: COc1ccc2CN(CCc2c1)c1noc(n1)-c1cc(cc(c1)C(F)(F)F)C(F)(F)F
InChI Key: InChIKey=JVBFQLRIUDJMFW-UHFFFAOYSA-N
Data: 1 EC50
Activity Spreadsheet -- Enzyme Inhibition Constant Data from BindingDB
Found 1 hit for monomerid = 50357772
Trg + Lig
Ki
nM
ΔG°
kcal/mole
IC50
nM
Kd
nM
EC50/IC50
nM
koff
s-1
kon
M-1s-1
pHTemp
°C
Sphingosine 1-phosphate receptor 1
(Homo sapiens (Human))
BDBM50357772
(CHEMBL1916409)
Show SMILES COc1ccc2CN(CCc2c1)c1noc(n1)-c1cc(cc(c1)C(F)(F)F)C(F)(F)F
Show InChI InChI=1S/C20H15F6N3O2/c1-30-16-3-2-12-10-29(5-4-11(12)8-16)18-27-17(31-28-18)13-6-14(19(21,22)23)9-15(7-13)20(24,25)26/h2-3,6-9H,4-5,10H2,1H3
Reactome pathway
n/an/an/an/a 1n/an/an/an/a
Arena Pharmaceuticals
Curated by ChEMBL
Assay Description
Agonist activity at human S1P1 receptor expressed in HEK293 cells assessed as inhibition of forskolin-stimulated cAMP production after 1 hr by HTRF a...
Bioorg Med Chem Lett 21: 6013-8 (2011)
Article DOI: 10.1016/j.bmcl.2011.05.110
BindingDB Entry DOI: 10.7270/Q24T6JSB