BDBM50357782 CHEMBL1916580
SMILES: COc1cc(cc(c1)-c1nc(no1)-c1ccc2N(CCc2c1)C(=O)CCC(O)=O)C#N
InChI Key: InChIKey=WCUDYJGXKCOLCU-UHFFFAOYSA-N
Data: 1 EC50
Activity Spreadsheet -- Enzyme Inhibition Constant Data from BindingDB
Found 1 hit for monomerid = 50357782
Trg + Lig
Ki
nM
ΔG°
kcal/mole
IC50
nM
Kd
nM
EC50/IC50
nM
koff
s-1
kon
M-1s-1
pHTemp
°C
Sphingosine 1-phosphate receptor 1
(Homo sapiens (Human))
BDBM50357782
(CHEMBL1916580)
Show SMILES COc1cc(cc(c1)-c1nc(no1)-c1ccc2N(CCc2c1)C(=O)CCC(O)=O)C#N
Show InChI InChI=1S/C22H18N4O5/c1-30-17-9-13(12-23)8-16(11-17)22-24-21(25-31-22)15-2-3-18-14(10-15)6-7-26(18)19(27)4-5-20(28)29/h2-3,8-11H,4-7H2,1H3,(H,28,29)
Reactome pathway
n/an/an/an/a 10.3n/an/an/an/a
Arena Pharmaceuticals
Curated by ChEMBL
Assay Description
Agonist activity at human S1P1 receptor expressed in HEK293 cells assessed as inhibition of forskolin-stimulated cAMP production after 1 hr by HTRF a...
Bioorg Med Chem Lett 21: 6013-8 (2011)
Article DOI: 10.1016/j.bmcl.2011.05.110
BindingDB Entry DOI: 10.7270/Q24T6JSB