BDBM50357791 CHEMBL1916568
SMILES: COc1cc(ccc1OC(F)F)-c1nc(no1)-c1ccc2N(CCc2c1)C(=O)CCC(O)=O
InChI Key: InChIKey=DJGHLXOQQKKYFO-UHFFFAOYSA-N
Data: 1 EC50
Activity Spreadsheet -- Enzyme Inhibition Constant Data from BindingDB
Found 1 hit for monomerid = 50357791
Trg + Lig
Ki
nM
ΔG°
kcal/mole
IC50
nM
Kd
nM
EC50/IC50
nM
koff
s-1
kon
M-1s-1
pHTemp
°C
Sphingosine 1-phosphate receptor 1
(Homo sapiens (Human))
BDBM50357791
(CHEMBL1916568)
Show SMILES COc1cc(ccc1OC(F)F)-c1nc(no1)-c1ccc2N(CCc2c1)C(=O)CCC(O)=O
Show InChI InChI=1S/C22H19F2N3O6/c1-31-17-11-14(3-5-16(17)32-22(23)24)21-25-20(26-33-21)13-2-4-15-12(10-13)8-9-27(15)18(28)6-7-19(29)30/h2-5,10-11,22H,6-9H2,1H3,(H,29,30)
Reactome pathway
n/an/an/an/a 1.5n/an/an/an/a
Arena Pharmaceuticals
Curated by ChEMBL
Assay Description
Agonist activity at human S1P1 receptor expressed in HEK293 cells assessed as inhibition of forskolin-stimulated cAMP production after 1 hr by HTRF a...
Bioorg Med Chem Lett 21: 6013-8 (2011)
Article DOI: 10.1016/j.bmcl.2011.05.110
BindingDB Entry DOI: 10.7270/Q24T6JSB