BDBM50357868 CHEMBL1916128
SMILES: COc1cc(OCc2ccccc2)cc2c1nc(C)c1c(C)nc(-c3cccnc3C)n21
InChI Key: InChIKey=FPWOWXHTJZXANJ-UHFFFAOYSA-N
Data: 1 IC50
Activity Spreadsheet -- Enzyme Inhibition Constant Data from BindingDB
Found 1 hit for monomerid = 50357868
Trg + Lig
Ki
nM
ΔG°
kcal/mole
IC50
nM
Kd
nM
EC50/IC50
nM
koff
s-1
kon
M-1s-1
pHTemp
°C
cAMP and cAMP-inhibited cGMP 3',5'-cyclic phosphodiesterase 10A
(Homo sapiens (Human))
BDBM50357868
(CHEMBL1916128)
Show SMILES COc1cc(OCc2ccccc2)cc2c1nc(C)c1c(C)nc(-c3cccnc3C)n21
Show InChI InChI=1S/C26H24N4O2/c1-16-21(11-8-12-27-16)26-29-18(3)25-17(2)28-24-22(30(25)26)13-20(14-23(24)31-4)32-15-19-9-6-5-7-10-19/h5-14H,15H2,1-4H3
Reactome pathway
n/an/a 0.0500n/an/an/an/an/an/a
Pfizer Inc.
Curated by ChEMBL
Assay Description
Inhibition of N-terminal His-tagged human PDE10A expressed in Escherichia coli using [3H]cAMP after 1 hr by scintillation proximity assay
J Med Chem 54: 7621-38 (2011)
Article DOI: 10.1021/jm2009138
BindingDB Entry DOI: 10.7270/Q2125T2B