BDBM50357885 CHEMBL1916343
SMILES: Cc1ccccc1-c1nccc2c(ccnc12)-c1ccc(F)cc1F
InChI Key: InChIKey=VHNQLSBSUPITCK-UHFFFAOYSA-N
Data: 1 IC50
Activity Spreadsheet -- Enzyme Inhibition Constant Data from BindingDB
Found 1 hit for monomerid = 50357885
Trg + Lig
Ki
nM
ΔG°
kcal/mole
IC50
nM
Kd
nM
EC50/IC50
nM
koff
s-1
kon
M-1s-1
pHTemp
°C
Mitogen-activated protein kinase 14
(Homo sapiens (Human))
BDBM50357885
(CHEMBL1916343)
Show SMILES Cc1ccccc1-c1nccc2c(ccnc12)-c1ccc(F)cc1F
Show InChI InChI=1S/C21H14F2N2/c1-13-4-2-3-5-15(13)20-21-18(9-11-24-20)16(8-10-25-21)17-7-6-14(22)12-19(17)23/h2-12H,1H3
NCI pathway
Reactome pathway
n/an/a>1.00E+3n/an/an/an/an/an/a
Rhône-Poulenc Rorer
Curated by ChEMBL
Assay Description
Inhibition of human p38alpha MAP kinase after 1 hr by FRET analysis
J Med Chem 54: 7899-910 (2011)
Article DOI: 10.1021/jm200975u
BindingDB Entry DOI: 10.7270/Q2MW2HKR