BDBM50357888 CHEMBL1916345
SMILES: [O-][n+]1ccc2c(ccnc2c1-c1ccccc1Cl)-c1ccc(F)cc1F
InChI Key: InChIKey=JKDZPMYNOISXOZ-UHFFFAOYSA-N
Data: 1 IC50
Activity Spreadsheet -- Enzyme Inhibition Constant Data from BindingDB
Found 1 hit for monomerid = 50357888
Trg + Lig
Ki
nM
ΔG°
kcal/mole
IC50
nM
Kd
nM
EC50/IC50
nM
koff
s-1
kon
M-1s-1
pHTemp
°C
Mitogen-activated protein kinase 14
(Homo sapiens (Human))
BDBM50357888
(CHEMBL1916345)
Show SMILES [O-][n+]1ccc2c(ccnc2c1-c1ccccc1Cl)-c1ccc(F)cc1F |(3.33,-20.74,;4.66,-19.97,;4.66,-18.43,;5.99,-17.65,;7.33,-18.42,;8.66,-17.64,;10,-18.42,;10,-19.97,;8.66,-20.74,;7.33,-19.97,;6,-20.74,;6,-22.27,;7.33,-23.04,;7.34,-24.57,;6,-25.35,;4.67,-24.58,;4.67,-23.05,;3.33,-22.28,;8.66,-16.11,;7.33,-15.35,;7.33,-13.81,;8.66,-13.03,;8.66,-11.49,;10,-13.8,;10,-15.34,;11.33,-16.11,)|
Show InChI InChI=1S/C20H11ClF2N2O/c21-17-4-2-1-3-16(17)20-19-15(8-10-25(20)26)13(7-9-24-19)14-6-5-12(22)11-18(14)23/h1-11H
NCI pathway
Reactome pathway
n/an/a 195n/an/an/an/an/an/a
Rhône-Poulenc Rorer
Curated by ChEMBL
Assay Description
Inhibition of human p38alpha MAP kinase after 1 hr by FRET analysis
J Med Chem 54: 7899-910 (2011)
Article DOI: 10.1021/jm200975u
BindingDB Entry DOI: 10.7270/Q2MW2HKR