BDBM50357908 CHEMBL1916522
SMILES: [O-][n+]1ccc2c(cc(nc2c1-c1c(Cl)cccc1Cl)-c1cccnc1)-c1ccc(F)cc1Cl
InChI Key: InChIKey=QLDLDJXQTQSWMX-UHFFFAOYSA-N
Data: 1 IC50
Activity Spreadsheet -- Enzyme Inhibition Constant Data from BindingDB
Found 1 hit for monomerid = 50357908
Trg + Lig
Ki
nM
ΔG°
kcal/mole
IC50
nM
Kd
nM
EC50/IC50
nM
koff
s-1
kon
M-1s-1
pHTemp
°C
Mitogen-activated protein kinase 14
(Homo sapiens (Human))
BDBM50357908
(CHEMBL1916522)
Show SMILES [O-][n+]1ccc2c(cc(nc2c1-c1c(Cl)cccc1Cl)-c1cccnc1)-c1ccc(F)cc1Cl |(20.56,-4.2,;21.9,-3.43,;21.9,-1.88,;23.23,-1.11,;24.57,-1.88,;25.9,-1.1,;27.24,-1.88,;27.24,-3.43,;25.9,-4.19,;24.56,-3.42,;23.23,-4.2,;23.24,-5.73,;21.9,-6.5,;20.57,-5.74,;21.91,-8.04,;23.24,-8.81,;24.58,-8.03,;24.57,-6.49,;25.9,-5.72,;28.57,-4.19,;28.56,-5.74,;29.89,-6.51,;31.23,-5.74,;31.23,-4.2,;29.9,-3.43,;25.9,.43,;27.24,1.2,;27.24,2.74,;25.9,3.51,;25.9,5.05,;24.56,2.73,;24.57,1.2,;23.24,.42,)|
Show InChI InChI=1S/C25H13Cl3FN3O/c26-19-4-1-5-20(27)23(19)25-24-17(8-10-32(25)33)18(16-7-6-15(29)11-21(16)28)12-22(31-24)14-3-2-9-30-13-14/h1-13H
NCI pathway
Reactome pathway
n/an/a 14n/an/an/an/an/an/a
Rhône-Poulenc Rorer
Curated by ChEMBL
Assay Description
Inhibition of human p38alpha MAP kinase after 1 hr by FRET analysis
J Med Chem 54: 7899-910 (2011)
Article DOI: 10.1021/jm200975u
BindingDB Entry DOI: 10.7270/Q2MW2HKR