BDBM50358132 CHEMBL1923955
SMILES: CC(C)[C@H](NS(=O)(=O)c1ccc2ccccc2c1)C(=O)N[C@@H](Cc1ccccc1)C=O
InChI Key: InChIKey=SJKUJZDIIXDACO-GMAHTHKFSA-N
Data: 1 IC50
Activity Spreadsheet -- Enzyme Inhibition Constant Data from BindingDB
Found 1 hit for monomerid = 50358132
Trg + Lig
Ki
nM
ΔG°
kcal/mole
IC50
nM
Kd
nM
EC50/IC50
nM
koff
s-1
kon
M-1s-1
pHTemp
°C
Calpain 1
(Rattus norvegicus)
BDBM50358132
(CHEMBL1923955)
Show SMILES CC(C)[C@H](NS(=O)(=O)c1ccc2ccccc2c1)C(=O)N[C@@H](Cc1ccccc1)C=O |r|
Show InChI InChI=1S/C24H26N2O4S/c1-17(2)23(24(28)25-21(16-27)14-18-8-4-3-5-9-18)26-31(29,30)22-13-12-19-10-6-7-11-20(19)15-22/h3-13,15-17,21,23,26H,14H2,1-2H3,(H,25,28)/t21-,23-/m0/s1
n/an/a 14n/an/an/an/an/an/a
University of Canterbury
Curated by ChEMBL
Assay Description
Inhibition of rat CAPN1 using BODIPY-labeled casein substrate by fluorometric analysis
J Med Chem 54: 7503-22 (2011)
Article DOI: 10.1021/jm200471r
BindingDB Entry DOI: 10.7270/Q2F47PJ4