BDBM50358135 CHEMBL1923958
SMILES: CC(C)[C@H](NS(=O)(=O)c1ccc(F)cc1)C(=O)N[C@@H](C)C=O
InChI Key: InChIKey=MUECCMJWJSSBRQ-GWCFXTLKSA-N
Data: 1 IC50
Activity Spreadsheet -- Enzyme Inhibition Constant Data from BindingDB
Found 1 hit for monomerid = 50358135
Trg + Lig
Ki
nM
ΔG°
kcal/mole
IC50
nM
Kd
nM
EC50/IC50
nM
koff
s-1
kon
M-1s-1
pHTemp
°C
Calpain 1
(Rattus norvegicus)
BDBM50358135
(CHEMBL1923958)
Show SMILES CC(C)[C@H](NS(=O)(=O)c1ccc(F)cc1)C(=O)N[C@@H](C)C=O |r|
Show InChI InChI=1S/C14H19FN2O4S/c1-9(2)13(14(19)16-10(3)8-18)17-22(20,21)12-6-4-11(15)5-7-12/h4-10,13,17H,1-3H3,(H,16,19)/t10-,13-/m0/s1
n/an/a 630n/an/an/an/an/an/a
University of Canterbury
Curated by ChEMBL
Assay Description
Inhibition of rat CAPN1 using BODIPY-labeled casein substrate by fluorometric analysis
J Med Chem 54: 7503-22 (2011)
Article DOI: 10.1021/jm200471r
BindingDB Entry DOI: 10.7270/Q2F47PJ4