BDBM50358147 CHEMBL1921824
SMILES: CC(C)[C@@H]1NC(=O)[C@H](Cc2ccc(OCCC[C@H](NC1=O)C=O)cc2)NS(=O)(=O)c1ccc(F)cc1
InChI Key: InChIKey=BCNSUVPKYDTBNV-VJBMBRPKSA-N
Data: 1 IC50
Activity Spreadsheet -- Enzyme Inhibition Constant Data from BindingDB
Found 1 hit for monomerid = 50358147
Trg + Lig
Ki
nM
ΔG°
kcal/mole
IC50
nM
Kd
nM
EC50/IC50
nM
koff
s-1
kon
M-1s-1
pHTemp
°C
Calpain-2 (m-Calpain)
(Homo sapiens (Human))
BDBM50358147
(CHEMBL1921824)
Show SMILES CC(C)[C@@H]1NC(=O)[C@H](Cc2ccc(OCCC[C@H](NC1=O)C=O)cc2)NS(=O)(=O)c1ccc(F)cc1 |r|
Show InChI InChI=1S/C25H30FN3O6S/c1-16(2)23-25(32)27-19(15-30)4-3-13-35-20-9-5-17(6-10-20)14-22(24(31)28-23)29-36(33,34)21-11-7-18(26)8-12-21/h5-12,15-16,19,22-23,29H,3-4,13-14H2,1-2H3,(H,27,32)(H,28,31)/t19-,22-,23-/m0/s1
n/an/a 3.71E+3n/an/an/an/an/an/a
University of Canterbury
Curated by ChEMBL
Assay Description
Inhibition of CAPN2 using BODIPY-labeled casein substrate by fluorometric analysis
J Med Chem 54: 7503-22 (2011)
Article DOI: 10.1021/jm200471r
BindingDB Entry DOI: 10.7270/Q2F47PJ4