BDBM50358257 CHEMBL1922226
SMILES: COc1ccc(cc1)C(=O)Nc1ccccc1NC(=O)c1ccc(cc1)N1CCCN(C)CC1
InChI Key: InChIKey=TWOOCLLLACQULH-UHFFFAOYSA-N
Data: 1 IC50
Activity Spreadsheet -- Enzyme Inhibition Constant Data from BindingDB
Found 1 hit for monomerid = 50358257
Trg + Lig
Ki
nM
ΔG°
kcal/mole
IC50
nM
Kd
nM
EC50/IC50
nM
koff
s-1
kon
M-1s-1
pHTemp
°C
Coagulation factor X
(Homo sapiens (Human))
BDBM50358257
(CHEMBL1922226)
Show SMILES COc1ccc(cc1)C(=O)Nc1ccccc1NC(=O)c1ccc(cc1)N1CCCN(C)CC1
Show InChI InChI=1S/C27H30N4O3/c1-30-16-5-17-31(19-18-30)22-12-8-20(9-13-22)26(32)28-24-6-3-4-7-25(24)29-27(33)21-10-14-23(34-2)15-11-21/h3-4,6-15H,5,16-19H2,1-2H3,(H,28,32)(H,29,33)
Reactome pathway
n/an/a 103n/an/an/an/an/an/a
Astellas Pharma Inc
Curated by ChEMBL
Assay Description
Inhibition of human factor 10A using chromogenic substrate S2222 by fluorometric analysis
J Med Chem 54: 8051-65 (2011)
Article DOI: 10.1021/jm200868m
BindingDB Entry DOI: 10.7270/Q2D50ND9