null
SMILES: Cn1c2cc(Cl)c(Cl)cc2n(Cc2ccc(cc2)C(=O)Nc2nnn[nH]2)c1=Nc1ccc(OC(F)(F)F)cc1
InChI Key: InChIKey=UFYRDSYYSNLTNS-UHFFFAOYSA-N
Activity Spreadsheet -- Enzyme Inhibition Constant Data from BindingDB
Found 2 hits for monomerid = 50358346
Trg + Lig
Ki
nM
ΔG°
kcal/mole
IC50
nM
Kd
nM
EC50/IC50
nM
koff
s-1
kon
M-1s-1
pHTemp
°C
Glucagon receptor
(Homo sapiens (Human))
BDBM50358346
(CHEMBL1922696)
Show SMILES Cn1c2cc(Cl)c(Cl)cc2n(Cc2ccc(cc2)C(=O)Nc2nnn[nH]2)c1=Nc1ccc(OC(F)(F)F)cc1 |w:27.31|
Show InChI InChI=1S/C24H17Cl2F3N8O2/c1-36-19-10-17(25)18(26)11-20(19)37(23(36)30-15-6-8-16(9-7-15)39-24(27,28)29)12-13-2-4-14(5-3-13)21(38)31-22-32-34-35-33-22/h2-11H,12H2,1H3,(H2,31,32,33,34,35,38)
n/an/a 23n/an/an/an/an/an/a
Merck Research Laboratories
Curated by ChEMBL
Assay Description
Antagonist activity at human GCGR expressed in CHO cells assessed as inhibition of glucagon-induced [125I]cAMP accumulation after 30 mins by scintill...
Bioorg Med Chem Lett 21: 7131-6 (2011)
Article DOI: 10.1016/j.bmcl.2011.09.085
BindingDB Entry DOI: 10.7270/Q2C829QP
Glucagon receptor
(Homo sapiens (Human))
BDBM50358346
(CHEMBL1922696)
Show SMILES Cn1c2cc(Cl)c(Cl)cc2n(Cc2ccc(cc2)C(=O)Nc2nnn[nH]2)c1=Nc1ccc(OC(F)(F)F)cc1 |w:27.31|
Show InChI InChI=1S/C24H17Cl2F3N8O2/c1-36-19-10-17(25)18(26)11-20(19)37(23(36)30-15-6-8-16(9-7-15)39-24(27,28)29)12-13-2-4-14(5-3-13)21(38)31-22-32-34-35-33-22/h2-11H,12H2,1H3,(H2,31,32,33,34,35,38)
n/an/a 4n/an/an/an/an/an/a
Merck Research Laboratories
Curated by ChEMBL
Assay Description
Displacement of [125I]glucagon from human GCGR expressed in CHO cells after 4 to 12 hrs by scintillation counting
Bioorg Med Chem Lett 21: 7131-6 (2011)
Article DOI: 10.1016/j.bmcl.2011.09.085
BindingDB Entry DOI: 10.7270/Q2C829QP