null
SMILES: CCCCCCCCCC(=O)C(O)c1ccccc1Br
InChI Key: InChIKey=JOZVRPQOXHFYSQ-UHFFFAOYSA-N
Activity Spreadsheet -- Enzyme Inhibition Constant Data from BindingDB
Found 1 hit for monomerid = 50358425
Trg + Lig
Ki
nM
ΔG°
kcal/mole
IC50
nM
Kd
nM
EC50/IC50
nM
koff
s-1
kon
M-1s-1
pHTemp
°C
CAI-1 autoinducer sensor kinase/phosphatase CqsS
(Vibrio cholerae serotype O1 (strain ATCC 39315 / E...)
BDBM50358425
(CHEMBL1922892)
Show SMILES CCCCCCCCCC(=O)C(O)c1ccccc1Br
Show InChI InChI=1S/C17H25BrO2/c1-2-3-4-5-6-7-8-13-16(19)17(20)14-11-9-10-12-15(14)18/h9-12,17,20H,2-8,13H2,1H3
n/an/a>5.00E+5n/an/an/an/an/an/a
Princeton University
Curated by ChEMBL
Assay Description
Antagonist activity at CqsS receptor in Vibrio cholerae MM920 assessed as inhibition of quorum sensing regulated CAI-1 induced bioluminescence after ...
Bioorg Med Chem 19: 6906-18 (2011)
Article DOI: 10.1016/j.bmc.2011.09.021
BindingDB Entry DOI: 10.7270/Q27H1K1T