null
SMILES: CCCCCCCCCC(=O)C(O)Cc1ccccc1
InChI Key: InChIKey=LSFAUNZMTCNPLV-UHFFFAOYSA-N
Activity Spreadsheet -- Enzyme Inhibition Constant Data from BindingDB
Found 1 hit for monomerid = 50358428
Trg + Lig
Ki
nM
ΔG°
kcal/mole
IC50
nM
Kd
nM
EC50/IC50
nM
koff
s-1
kon
M-1s-1
pHTemp
°C
CAI-1 autoinducer sensor kinase/phosphatase CqsS
(Vibrio cholerae serotype O1 (strain ATCC 39315 / E...)
BDBM50358428
(CHEMBL1922895)
Show SMILES CCCCCCCCCC(=O)C(O)Cc1ccccc1
Show InChI InChI=1S/C18H28O2/c1-2-3-4-5-6-7-11-14-17(19)18(20)15-16-12-9-8-10-13-16/h8-10,12-13,18,20H,2-7,11,14-15H2,1H3
n/an/a 1.36E+5n/an/an/an/an/an/a
Princeton University
Curated by ChEMBL
Assay Description
Antagonist activity at CqsS receptor in Vibrio cholerae MM920 assessed as inhibition of quorum sensing regulated CAI-1 induced bioluminescence after ...
Bioorg Med Chem 19: 6906-18 (2011)
Article DOI: 10.1016/j.bmc.2011.09.021
BindingDB Entry DOI: 10.7270/Q27H1K1T