BDBM50358468 CHEMBL1923011
SMILES: OCCOCCn1ccc2ncnc(Nc3ccc(Oc4cccc(OC(F)(F)F)c4)c(Cl)c3)c12
InChI Key: InChIKey=ZYVUNNQGVXTJSW-UHFFFAOYSA-N
Data: 1 IC50
Activity Spreadsheet -- Enzyme Inhibition Constant Data from BindingDB
Found 1 hit for monomerid = 50358468
Trg + Lig
Ki
nM
ΔG°
kcal/mole
IC50
nM
Kd
nM
EC50/IC50
nM
koff
s-1
kon
M-1s-1
pHTemp
°C
Receptor tyrosine-protein kinase erbB-2
(Homo sapiens (Human))
BDBM50358468
(CHEMBL1923011)
Show SMILES OCCOCCn1ccc2ncnc(Nc3ccc(Oc4cccc(OC(F)(F)F)c4)c(Cl)c3)c12
Show InChI InChI=1S/C23H20ClF3N4O4/c24-18-12-15(4-5-20(18)34-16-2-1-3-17(13-16)35-23(25,26)27)30-22-21-19(28-14-29-22)6-7-31(21)8-10-33-11-9-32/h1-7,12-14,32H,8-11H2,(H,28,29,30)
n/an/a 8.40n/an/an/an/an/an/a
Takeda Pharmaceutical Company Limited
Curated by ChEMBL
Assay Description
Inhibition of human N-terminus peptide (DYKDDDD)-tagged HER2 expressed in baculovirus infected insect cells using [gamma-32P]ATP as substrate after 6...
J Med Chem 54: 8030-50 (2011)
Article DOI: 10.1021/jm2008634
BindingDB Entry DOI: 10.7270/Q23R0T93