BDBM50358594 CHEMBL1923986
SMILES: CNc1nc2[nH]c(cc2c2n(C)cnc12)-c1cccc(CNC(=O)C(C)(C)O)n1
InChI Key: InChIKey=FSGRIVUBVLBBLB-UHFFFAOYSA-N
Data: 1 IC50
Activity Spreadsheet -- Enzyme Inhibition Constant Data from BindingDB
Found 1 hit for monomerid = 50358594
Trg + Lig
Ki
nM
ΔG°
kcal/mole
IC50
nM
Kd
nM
EC50/IC50
nM
koff
s-1
kon
M-1s-1
pHTemp
°C
Inhibitor of nuclear factor kappa-B kinase subunit beta
(Homo sapiens (Human))
BDBM50358594
(CHEMBL1923986)
Show SMILES CNc1nc2[nH]c(cc2c2n(C)cnc12)-c1cccc(CNC(=O)C(C)(C)O)n1
Show InChI InChI=1S/C20H23N7O2/c1-20(2,29)19(28)22-9-11-6-5-7-13(24-11)14-8-12-16-15(23-10-27(16)4)18(21-3)26-17(12)25-14/h5-8,10,29H,9H2,1-4H3,(H,22,28)(H2,21,25,26)
NCI pathway
Reactome pathway
n/an/a 12n/an/an/an/an/an/a
Bristol-Myers Squibb Research and Development
Curated by ChEMBL
Assay Description
Inhibition of human IKK2-mediated GST-IkappaBalpha protein fusion phosphorylation
Bioorg Med Chem Lett 21: 7006-12 (2011)
Article DOI: 10.1016/j.bmcl.2011.09.111
BindingDB Entry DOI: 10.7270/Q2Z038KC