BDBM50358597 CHEMBL1923989
SMILES: CNc1nc2[nH]c(cc2c2n(C)cnc12)-c1cccc(CN(C)C(=O)COC)n1
InChI Key: InChIKey=IDLZPACLHTWGRU-UHFFFAOYSA-N
Data: 1 IC50
Activity Spreadsheet -- Enzyme Inhibition Constant Data from BindingDB
Found 1 hit for monomerid = 50358597
Trg + Lig
Ki
nM
ΔG°
kcal/mole
IC50
nM
Kd
nM
EC50/IC50
nM
koff
s-1
kon
M-1s-1
pHTemp
°C
Inhibitor of nuclear factor kappa-B kinase subunit beta
(Homo sapiens (Human))
BDBM50358597
(CHEMBL1923989)
Show SMILES CNc1nc2[nH]c(cc2c2n(C)cnc12)-c1cccc(CN(C)C(=O)COC)n1
Show InChI InChI=1S/C20H23N7O2/c1-21-20-17-18(27(3)11-22-17)13-8-15(24-19(13)25-20)14-7-5-6-12(23-14)9-26(2)16(28)10-29-4/h5-8,11H,9-10H2,1-4H3,(H2,21,24,25)
NCI pathway
Reactome pathway
n/an/a 19n/an/an/an/an/an/a
Bristol-Myers Squibb Research and Development
Curated by ChEMBL
Assay Description
Inhibition of human IKK2-mediated GST-IkappaBalpha protein fusion phosphorylation
Bioorg Med Chem Lett 21: 7006-12 (2011)
Article DOI: 10.1016/j.bmcl.2011.09.111
BindingDB Entry DOI: 10.7270/Q2Z038KC