BDBM50358864 CHEMBL1923449
SMILES: Cc1ccc2sc(cc2c1)S(=O)(=O)N[C@H]1CCCN(CC(=O)N2CCCC2)C1=O
InChI Key: InChIKey=KYXOUQUPDZTCFJ-INIZCTEOSA-N
Data: 1 IC50
Activity Spreadsheet -- Enzyme Inhibition Constant Data from BindingDB
Found 1 hit for monomerid = 50358864
Trg + Lig
Ki
nM
ΔG°
kcal/mole
IC50
nM
Kd
nM
EC50/IC50
nM
koff
s-1
kon
M-1s-1
pHTemp
°C
Coagulation factor X
(Homo sapiens (Human))
BDBM50358864
(CHEMBL1923449)
Show SMILES Cc1ccc2sc(cc2c1)S(=O)(=O)N[C@H]1CCCN(CC(=O)N2CCCC2)C1=O |r|
Show InChI InChI=1S/C20H25N3O4S2/c1-14-6-7-17-15(11-14)12-19(28-17)29(26,27)21-16-5-4-10-23(20(16)25)13-18(24)22-8-2-3-9-22/h6-7,11-12,16,21H,2-5,8-10,13H2,1H3/t16-/m0/s1
Reactome pathway
n/an/a 1.95E+3n/an/an/an/an/an/a
Bristol-Myers Squibb Company
Curated by ChEMBL
Assay Description
Inhibition of human factor 10a using phenyl-Ile-Glu-Gly-Arg-pNA as substrate preincubated for 3 mins prior to substrate addition by spectrophotometry
Bioorg Med Chem Lett 21: 7516-21 (2011)
Article DOI: 10.1016/j.bmcl.2011.06.098
BindingDB Entry DOI: 10.7270/Q2MK6DBS