BDBM50358875 CHEMBL1923461
SMILES: Clc1ccc2cc(ccc2c1)S(=O)(=O)N[C@H]1CCCN(CC(=O)N2CCSC2)C1=O
InChI Key: InChIKey=ZUNXCVVMGRVVCM-SFHVURJKSA-N
Data: 1 IC50
Activity Spreadsheet -- Enzyme Inhibition Constant Data from BindingDB
Found 1 hit for monomerid = 50358875
Trg + Lig
Ki
nM
ΔG°
kcal/mole
IC50
nM
Kd
nM
EC50/IC50
nM
koff
s-1
kon
M-1s-1
pHTemp
°C
Coagulation factor X
(Homo sapiens (Human))
BDBM50358875
(CHEMBL1923461)
Show SMILES Clc1ccc2cc(ccc2c1)S(=O)(=O)N[C@H]1CCCN(CC(=O)N2CCSC2)C1=O |r|
Show InChI InChI=1S/C20H22ClN3O4S2/c21-16-5-3-15-11-17(6-4-14(15)10-16)30(27,28)22-18-2-1-7-23(20(18)26)12-19(25)24-8-9-29-13-24/h3-6,10-11,18,22H,1-2,7-9,12-13H2/t18-/m0/s1
Reactome pathway
n/an/a 58n/an/an/an/an/an/a
Bristol-Myers Squibb Company
Curated by ChEMBL
Assay Description
Inhibition of human factor 10a using phenyl-Ile-Glu-Gly-Arg-pNA as substrate preincubated for 3 mins prior to substrate addition by spectrophotometry
Bioorg Med Chem Lett 21: 7516-21 (2011)
Article DOI: 10.1016/j.bmcl.2011.06.098
BindingDB Entry DOI: 10.7270/Q2MK6DBS