null
SMILES: COc1ccc(cn1)-c1ccc2cnc(Nc3ccc(N4CCN(C)CC4)c(F)c3)nn12
InChI Key: InChIKey=BMRWKIYVKWSZAZ-UHFFFAOYSA-N
Activity Spreadsheet -- Enzyme Inhibition Constant Data from BindingDB
Found 1 hit for monomerid = 50358913
Trg + Lig
Ki
nM
ΔG°
kcal/mole
IC50
nM
Kd
nM
EC50/IC50
nM
koff
s-1
kon
M-1s-1
pHTemp
°C
Tyrosine-protein kinase JAK2
(Homo sapiens (Human))
BDBM50358913
(CHEMBL1923589)
Show SMILES COc1ccc(cn1)-c1ccc2cnc(Nc3ccc(N4CCN(C)CC4)c(F)c3)nn12
Show InChI InChI=1S/C23H24FN7O/c1-29-9-11-30(12-10-29)21-6-4-17(13-19(21)24)27-23-26-15-18-5-7-20(31(18)28-23)16-3-8-22(32-2)25-14-16/h3-8,13-15H,9-12H2,1-2H3,(H,27,28)
Reactome pathway
n/an/a 0.400n/an/an/an/an/an/a
Cephalon, Inc.
Curated by ChEMBL
Assay Description
Inhibition of human recombinant JAK2 using biotinyl-amino-hexanoyl-EQEDEPEGDYFEWLE-amide as substrate after 20 mins by fluorescence assay
Bioorg Med Chem Lett 21: 7325-30 (2011)
Article DOI: 10.1016/j.bmcl.2011.10.032
BindingDB Entry DOI: 10.7270/Q2GT5NM2