null
SMILES: COc1cc(cc(NC(=O)c2nc3CCN(Cc3s2)C(C)C)c1CCC(=O)Nc1ccc(Cl)cc1)C(O)=O
InChI Key: InChIKey=JAMWLUUMKDBCCE-UHFFFAOYSA-N
Activity Spreadsheet -- Enzyme Inhibition Constant Data from BindingDB
Found 1 hit for monomerid = 50359001
Trg + Lig
Ki
nM
ΔG°
kcal/mole
IC50
nM
Kd
nM
EC50/IC50
nM
koff
s-1
kon
M-1s-1
pHTemp
°C
Coagulation factor X
(Homo sapiens (Human))
BDBM50359001
(CHEMBL1923894)
Show SMILES COc1cc(cc(NC(=O)c2nc3CCN(Cc3s2)C(C)C)c1CCC(=O)Nc1ccc(Cl)cc1)C(O)=O
Show InChI InChI=1S/C27H29ClN4O5S/c1-15(2)32-11-10-20-23(14-32)38-26(31-20)25(34)30-21-12-16(27(35)36)13-22(37-3)19(21)8-9-24(33)29-18-6-4-17(28)5-7-18/h4-7,12-13,15H,8-11,14H2,1-3H3,(H,29,33)(H,30,34)(H,35,36)
Reactome pathway
n/an/a 0.540n/an/an/an/an/an/a
Daiichi Sankyo Co., Ltd
Curated by ChEMBL
Assay Description
Inhibition of human factor 10a using S-2222 as substrate by spectrophotometry
Bioorg Med Chem Lett 21: 7337-43 (2011)
Article DOI: 10.1016/j.bmcl.2011.10.021
BindingDB Entry DOI: 10.7270/Q2V40VM5