BDBM50359015 CHEMBL1924016
SMILES: COc1cc(Oc2ccc(cc2)C(=O)NCCN2CCCCC2)c(NS(=O)(=O)c2ccc(Cl)c(c2)C(F)(F)F)cc1Cl
InChI Key: InChIKey=FMMGEWPMVFMHDR-UHFFFAOYSA-N
Data: 1 KI  1 Kd
Activity Spreadsheet -- Enzyme Inhibition Constant Data from BindingDB
Found 2 hits for monomerid = 50359015
Trg + Lig
Ki
nM
ΔG°
kcal/mole
IC50
nM
Kd
nM
EC50/IC50
nM
koff
s-1
kon
M-1s-1
pHTemp
°C
C-C chemokine receptor type 2
(Homo sapiens (Human))
BDBM50359015
(CHEMBL1924016)
Show SMILES COc1cc(Oc2ccc(cc2)C(=O)NCCN2CCCCC2)c(NS(=O)(=O)c2ccc(Cl)c(c2)C(F)(F)F)cc1Cl
Show InChI InChI=1S/C28H28Cl2F3N3O5S/c1-40-25-17-26(41-19-7-5-18(6-8-19)27(37)34-11-14-36-12-3-2-4-13-36)24(16-23(25)30)35-42(38,39)20-9-10-22(29)21(15-20)28(31,32)33/h5-10,15-17,35H,2-4,11-14H2,1H3,(H,34,37)
10n/an/an/an/an/an/an/an/a
GlaxoSmithKline
Curated by ChEMBL
Assay Description
Antagonist activity at human CCR2 receptor expressed in CHO cells assessed as inhibition of MCP1-induced [35S]-GTPgammaS binding after 3 hrs
Bioorg Med Chem Lett 21: 7291-4 (2011)
Article DOI: 10.1016/j.bmcl.2011.10.038
BindingDB Entry DOI: 10.7270/Q2KK9C6D
C-C chemokine receptor type 2
(Homo sapiens (Human))
BDBM50359015
(CHEMBL1924016)
Show SMILES COc1cc(Oc2ccc(cc2)C(=O)NCCN2CCCCC2)c(NS(=O)(=O)c2ccc(Cl)c(c2)C(F)(F)F)cc1Cl
Show InChI InChI=1S/C28H28Cl2F3N3O5S/c1-40-25-17-26(41-19-7-5-18(6-8-19)27(37)34-11-14-36-12-3-2-4-13-36)24(16-23(25)30)35-42(38,39)20-9-10-22(29)21(15-20)28(31,32)33/h5-10,15-17,35H,2-4,11-14H2,1H3,(H,34,37)
n/an/an/a 398n/an/an/an/an/a
GlaxoSmithKline
Curated by ChEMBL
Assay Description
Antagonist activity at CCR2 receptor in human whole blood assessed as inhibition of MCP-1 induced monocyte shape change pretreated for 15 mins before...
Bioorg Med Chem Lett 21: 7291-4 (2011)
Article DOI: 10.1016/j.bmcl.2011.10.038
BindingDB Entry DOI: 10.7270/Q2KK9C6D