BDBM50359049 CHEMBL1922512
SMILES: CCCCCCCCN1SCCC1=O
InChI Key: InChIKey=AVGVFDSUDIUXEU-UHFFFAOYSA-N
Data: 4 IC50
Activity Spreadsheet -- Enzyme Inhibition Constant Data from BindingDB
Found 4 hits for monomerid = 50359049
Trg + Lig
Ki
nM
ΔG°
kcal/mole
IC50
nM
Kd
nM
EC50/IC50
nM
koff
s-1
kon
M-1s-1
pHTemp
°C
Monoglyceride lipase
(Homo sapiens (Human))
BDBM50359049
(CHEMBL1922512)
Show SMILES CCCCCCCCN1SCCC1=O
Show InChI InChI=1S/C11H21NOS/c1-2-3-4-5-6-7-9-12-11(13)8-10-14-12/h2-10H2,1H3
Reactome pathway
n/an/a 1.09E+3n/an/an/an/an/an/a
Universit£ catholique de Louvain
Curated by ChEMBL
Assay Description
Inhibition of human recombinant MAGL assessed as [3H]oleoylglycerol hydrolysis after 10 mins by liquid scintillation counting
Bioorg Med Chem Lett 21: 7321-4 (2011)
Article DOI: 10.1016/j.bmcl.2011.10.026
BindingDB Entry DOI: 10.7270/Q2B27VPC
Fatty-acid amide hydrolase 1
(Homo sapiens (Human))
BDBM50359049
(CHEMBL1922512)
Show SMILES CCCCCCCCN1SCCC1=O
Show InChI InChI=1S/C11H21NOS/c1-2-3-4-5-6-7-9-12-11(13)8-10-14-12/h2-10H2,1H3
n/an/a 1.89E+4n/an/an/an/an/an/a
Universit£ catholique de Louvain
Curated by ChEMBL
Assay Description
Inhibition of human recombinant FAAH assessed as conversion of [3H]AEA to [3H]ethanolamine after 10 mins by liquid scintillation counting
Bioorg Med Chem Lett 21: 7321-4 (2011)
Article DOI: 10.1016/j.bmcl.2011.10.026
BindingDB Entry DOI: 10.7270/Q2B27VPC
Monoglyceride lipase (MGL)
(Rattus norvegicus (Rat))
BDBM50359049
(CHEMBL1922512)
Show SMILES CCCCCCCCN1SCCC1=O
Show InChI InChI=1S/C11H21NOS/c1-2-3-4-5-6-7-9-12-11(13)8-10-14-12/h2-10H2,1H3
Reactome pathway
n/an/a 88n/an/an/an/an/an/a
Universit£ catholique de Louvain
Curated by ChEMBL
Assay Description
Inhibition of rat recombinant N-terminal his-tagged MAGL expressed in Escherichia coli DH5alpha assessed as 2-oleoylglycerol hydrolysis after 10 mins...
Bioorg Med Chem Lett 21: 7321-4 (2011)
Article DOI: 10.1016/j.bmcl.2011.10.026
BindingDB Entry DOI: 10.7270/Q2B27VPC
Monoglyceride lipase
(Homo sapiens (Human))
BDBM50359049
(CHEMBL1922512)
Show SMILES CCCCCCCCN1SCCC1=O
Show InChI InChI=1S/C11H21NOS/c1-2-3-4-5-6-7-9-12-11(13)8-10-14-12/h2-10H2,1H3
Reactome pathway
n/an/a 140n/an/an/an/an/an/a
Universit£ catholique de Louvain
Curated by ChEMBL
Assay Description
Inhibition of human recombinant MAGL assessed as inhibition of 2-oleoylglycerol hydrolysis preincubated for 10 mins by LC/MS analysis
Bioorg Med Chem Lett 21: 7321-4 (2011)
Article DOI: 10.1016/j.bmcl.2011.10.026
BindingDB Entry DOI: 10.7270/Q2B27VPC